program: Gaussian 09
title: 000246382
version: EM64L-G09RevD.01
frameworkgroup: C1[X(C5H11BrO3S)]
method: RPBEPBE
basis: SDD
operation: Freq
keyword: #p
keyword: freq=noraman
keyword: PBEPBE/SDD
title: #p freq=noraman PBEPBE/SDD
converged: YES YES NO NO
title: Mulliken charges:
elementType: Br S O O O C C C C C H H H H H H H H H H H
charge: -0.017842 1.039163 -0.412171 -0.513784 -0.527897 -0.247245 -0.512007 -0.332351 -0.630298 -0.669157 0.234883 0.219014 0.286051 0.281406 0.248818 0.244283 0.240121 0.249452 0.259672 0.280234 0.279653
chargesum: 0.00000
title: Mulliken charges with hydrogens summed into heavy atoms:
elementType: Br S O O O C C C C C
charge: -0.017842 1.039163 -0.412171 -0.513784 -0.527897 0.206653 0.055451 0.160750 0.118947 -0.109270
polarizability: 1.68385609e+02 -4.25237724e+00 9.06507181e+01 -5.03926419e-01 -4.61619512e-01 8.05044312e+01
1716.lowfreq: -8.6640 0.0020 0.0020 0.0021 3.1010 14.8714 17.9748 31.3474 36.9729
frequency: 15.5543 31.2145 36.7772 54.8428 86.4892 106.8615 118.8124 138.8165 186.9000 221.8852 240.2646 277.0374 298.6715 331.9698 350.4531 447.6570 549.4177 561.4868 625.5592 768.0100 782.3419 838.9171 847.3978 936.4301 939.8114 977.5779 1028.2394 1036.1690 1053.2203 1068.3877 1075.3942 1159.4787 1230.5044 1233.3467 1253.0585 1264.1931 1277.9139 1310.8918 1363.6790 1401.3335 1418.9426 1454.3053 1464.6908 1473.3561 1481.8539 1489.8305 2974.7838 2995.6985 3027.6173 3038.3273 3051.6159 3061.9318 3089.6487 3091.5417 3107.2231 3136.4504 3155.4232
redmass: 6.1665 2.3844 2.9426 4.2508 2.8405 2.6871 7.1578 5.8062 1.8660 4.5576 2.1101 3.7267 4.7426 5.3658 7.3373 5.0574 7.4654 10.6896 5.7235 1.0875 1.1760 7.9176 1.2614 7.6112 4.7507 1.6804 1.1818 4.2742 3.4870 1.5909 2.3307 1.2458 1.1698 1.2382 1.2508 1.2487 1.0851 1.2812 1.2973 1.1723 1.1131 1.0977 1.0348 1.0769 1.0525 1.0841 1.0544 1.0366 1.0594 1.1086 1.0562 1.0590 1.0959 1.1057 1.1022 1.1111 1.1099
irintensity: 1.0305 0.4029 7.0928 3.5897 1.0727 0.7504 1.5338 2.7154 0.2017 27.5114 4.6743 7.2364 7.2006 3.3396 23.8604 10.8766 11.6274 104.8067 80.6457 10.4394 3.5823 73.2403 8.2008 64.9363 92.5176 28.3245 0.9483 4.6593 12.4432 11.0109 3.0460 2.3256 17.2059 1.8819 2.0590 14.4523 1.2082 35.7190 11.9370 29.0425 3.1478 2.7183 20.6315 5.4869 12.4589 19.4007 36.2675 9.3065 6.1292 14.4503 23.1525 2.8435 7.7889 11.1897 6.5549 16.0274 1.8667
temp: 298.150 k
press: 1.00000 atm
elementType: 35 16 8 8 8 6 6 6 6 6 1 1 1 1 1 1 1 1 1 1 1
symmnumber: 1
zpe: 418933.5 jmol-1
zpe.correction: 0.159563 hartree
zpe.thermalcorrener: 0.173459 hartree
zpe.thermalcorrenthalpy: 0.174403 hartree
zpe.thermalcorrgfe: 0.114379 hartree
zpe.sumelectzpe: -833.320217 hartree
zpe.sumelectthermal: -833.306321 hartree
zpe.sumelectthermalent: -833.305377 hartree
zpe.sumelectthermalfe: -833.365401 hartree
dipole: 1.8551 2.7687 0.3732
dipole: 3.3536
quadrupole: -79.8101 -76.9221 -83.4551
quadrupole: 19.9683 1.4906 0.5939
quadrupole: 0.2524 3.1403 -3.3927 19.9683 1.4906 0.5939
hfenergy: -833.4797802 hartree
pointgroup: C01 [X(C5H11Br1O3S1)]
dipole: -0.8189187 0.9995914 -0.2664479 debye
dipolederiv: -0.629344 -0.0992292 0.0334473 -0.2150495 -0.2106207 0.0149796 0.0397096 0.0058748 -0.1370982 1.7963922 0.0557971 -0.0268282 0.3182155 1.197461 -0.0161902 0.0335606 0.0157403 1.2578283 -1.2755846 0.0318983 -0.0306077 0.0019614 -0.4837784 0.0055846 -0.0408644 -0.0282678 -0.4267201 -0.681067 -0.0025272 0.0537294 -0.0296324 -0.5544589 0.0606417 0.1643683 0.1063727 -0.6142223 -0.6139512 0.0278753 0.0009688 -0.0043856 -0.5732287 -0.0434855 -0.1088857 -0.1156021 -0.6085773 0.5770305 -0.0806064 0.0254061 -0.4724125 0.2708652 -0.0689479 -0.0547041 -0.0201398 0.3164918 0.2157412 -0.1927116 0.0448194 -0.2666988 0.0876138 -0.0144361 0.029193 -0.0105277 -0.0168233 -0.2879989 -0.0161889 0.0290142 0.1550504 -0.0003138 0.017287 0.049099 0.0062852 0.1144244 -0.1796237 0.0244091 0.0057824 0.2642059 -0.0971284 0.0248512 -0.0229366 0.0288727 0.0215617 0.7920109 0.2603076 -0.043954 0.1357519 0.2591023 -0.018272 -0.0581762 -0.022218 0.1359711 0.0324668 -0.0109723 -0.0309606 0.0954839 0.0151365 -0.056177 0.0242684 -0.0906095 -0.0488334 -0.0403041 0.0246332 -0.0022117 0.1033915 -0.0416329 0.0898214 -0.0263276 0.1205823 -0.0490143 0.0032649 0.0125766 -0.0443632 0.0069572 0.0069097 -0.0358242 -0.0736381 -0.0280266 0.0325699 -0.0065978 0.0278721 0.0398589 0.042448 0.0228729 0.0397313 0.0654464 0.0295111 0.0025861 0.0931016 -0.0013479 -0.0005325 0.0084519 0.0282516 -0.0778581 -0.0146611 -0.0879032 -0.0427524 0.0925149 0.0192879 -0.0196427 0.0328371 -0.0026579 0.084344 -0.0134001 0.0933422 -0.017271 -0.0304403 0.1113049 -0.0180303 0.0498532 -0.0300769 0.0222932 -0.0097668 0.0214043 0.1373607 0.0921938 -0.0167843 -0.0071162 -0.0940097 0.053435 -0.0991405 -0.045532 -0.0912648 0.0003489 0.1132073 -0.0125271 0.0029423 -0.0821496 0.1086566 0.0652774 0.0636219 0.0491181 -0.0340814 -0.0338927 -0.09083 -0.0329328 -0.0381805 -0.013405 -0.0846123 0.0240378 -0.0856599 -0.025509 -0.0291197 -0.0722372 0.0212111 -0.012089 -0.0430032 0.0901325 -0.0244125 0.1031156 0.0017598 unknown
polarizability: 167.1018648|9.9188408|91.6504975|-4.4060371|-1.4359693|80.7883963 unknown
InChI: InChI=1S/C5H11BrO3S/c1-2-10(7,8)9-5-3-4-6/h2-5H2,1H3
charge 0 multiplicity 1
21 atoms
Br 5.248009 0.742634 -0.214155
S  -1.708634 -0.458557 0.159213
O  -0.038039 0.384885 0.373606
O  -2.18687 -1.141959 1.545873
O  -1.65339 -1.353705 -1.193688
C  1.104722 -0.532455 0.169433
C  -2.652379 1.205176 -0.12781
C  2.34217 0.386099 0.094305
C  -4.154923 0.953351 -0.069688
C  3.608401 -0.452145 -0.120219
H  0.967185 -1.10085 -0.77206
H  1.179492 -1.237123 1.020508
H  -2.264416 1.842557 0.681568
H  -2.269603 1.531374 -1.106518
H  2.423487 0.966386 1.029669
H  2.213768 1.102378 -0.735789
H  -4.67835 1.917408 -0.208256
H  -4.48797 0.267542 -0.867105
H  -4.456274 0.538395 0.906985
H  3.604242 -0.997676 -1.076674
H  3.812773 -1.142115 0.713299
