program: Gaussian 09
title: 000246428
version: EM64L-G09RevD.01
frameworkgroup: C1[X(C17H24Cl4N4O2)]
method: RPBEPBE
basis: SDD
operation: Freq
keyword: #p
keyword: freq=noraman
keyword: PBEPBE/SDD
title: #p freq=noraman PBEPBE/SDD
converged: YES YES NO NO
title: Mulliken charges:
elementType: Cl Cl Cl Cl O O N N N N C C C C C C C C C C C C C C C C C H H H H H H H H H H H H H H H H H H H H H H H H
charge: -0.049045 -0.061907 -0.049424 -0.061176 -0.273500 -0.277622 -0.184931 -0.185493 -0.522607 -0.509873 0.364688 0.538554 0.256855 -0.410090 -0.320743 -0.406068 -0.322152 -0.464001 0.269054 0.271082 -0.519097 -0.383989 -0.568926 -0.577271 -0.848841 -0.568454 -0.575829 0.263133 0.238208 0.228459 0.279140 0.263145 0.231553 0.229292 0.282115 0.374799 0.344719 0.315313 0.220489 0.230900 0.269611 0.279880 0.315083 0.253515 0.227787 0.223842 0.250046 0.277235 0.279625 0.253799 0.309118
chargesum: 0.00000
title: Mulliken charges with hydrogens summed into heavy atoms:
elementType: Cl Cl Cl Cl O O N N N N C C C C C C C C C C C C C C C C C
charge: -0.049045 -0.061907 -0.049424 -0.061176 -0.273500 -0.277622 -0.184931 -0.185493 -0.177887 -0.194560 0.364688 0.538554 0.256855 0.091250 0.186855 0.088631 0.189255 -0.089203 0.269054 0.271082 -0.298608 -0.153089 -0.019435 -0.008672 -0.147165 -0.011595 -0.012912
polarizability: 3.62813791e+02 5.77623940e+00 3.25665918e+02 6.11539158e+00 2.32716428e+01 1.52299455e+02
1716.lowfreq: -7.7927 -2.0803 -0.6100 -0.0021 -0.0012 0.0007 4.0586 7.5254 18.7733
frequency: -6.1494 6.9612 18.7627 25.3435 27.0752 29.5846 35.6296 37.9356 65.4702 68.1910 76.5647 77.4427 82.9134 91.8493 96.1759 111.0083 116.4730 142.5997 162.5292 177.2498 194.3944 196.3848 211.1216 211.4783 227.2855 232.7032 240.6921 260.8578 271.9069 299.8636 317.3203 332.5448 348.6201 360.2171 402.0656 407.2463 450.0542 454.6735 469.4247 493.8105 544.0727 556.3068 567.4870 603.5656 622.1061 626.0170 637.0195 682.4166 685.2380 691.3254 694.9192 709.0700 712.3020 727.7764 761.5730 770.7135 780.4049 784.6336 789.2553 797.5309 804.0537 864.7141 872.8717 927.4977 952.3204 971.1865 980.7267 988.1343 997.1660 999.5843 1005.8455 1033.8212 1034.1816 1037.9676 1046.7303 1048.4694 1061.9841 1065.8325 1121.2222 1121.7715 1127.5203 1158.3815 1172.1560 1199.0110 1224.8939 1234.4381 1235.7456 1250.6158 1251.7881 1254.5775 1257.3868 1262.4525 1267.6224 1282.7288 1288.9517 1302.4717 1306.7903 1340.2597 1343.0003 1357.2658 1360.7331 1365.7935 1374.0709 1385.2428 1393.3068 1441.1898 1449.1636 1450.1817 1456.6354 1457.0602 1463.3389 1464.4121 1467.5918 1479.8625 1483.9225 1499.1631 1500.0121 1518.5380 1534.4484 1597.1636 1616.1840 1626.2455 1634.7423 2944.8094 2994.5753 3003.4983 3010.7685 3028.5125 3028.8822 3059.9339 3060.4055 3060.5433 3061.5667 3066.2290 3066.8029 3085.2703 3099.1196 3099.4894 3112.7963 3142.3650 3144.7408 3146.3080 3154.8950 3155.5688 3208.8938 3548.8871 3565.3974
redmass: 11.8328 11.0586 15.0331 8.4089 15.4905 11.5189 7.8021 8.1787 5.9684 5.4608 4.2379 3.8886 3.3439 3.2851 3.5431 2.6367 3.0448 3.8990 3.9838 6.3202 1.5350 2.7688 4.3779 4.2525 4.1187 4.7217 4.8240 4.6560 4.7028 4.4302 4.0644 3.6291 4.4939 4.9265 4.1577 3.9947 3.5218 2.8408 4.4758 4.1450 1.2703 1.3256 4.6497 5.8750 5.2742 3.8502 6.0475 5.6427 5.9163 6.1102 5.9819 7.3184 6.9061 3.1461 2.6722 1.8161 1.3092 1.3179 1.2102 1.8528 1.5091 5.7398 5.1195 1.3468 1.4826 2.4684 1.6420 1.9165 1.4803 1.4863 1.9019 4.4153 4.5173 1.5153 2.9043 2.9676 2.1694 1.9688 1.3460 1.3529 1.9926 1.6315 2.0865 1.8973 1.9551 2.4074 2.3675 1.1852 1.2124 1.2604 1.2561 1.3005 1.3696 1.4247 1.8908 1.3760 1.6069 1.3927 1.3905 1.5026 1.3923 1.6003 1.4374 2.6013 1.2673 4.2360 1.1018 1.0884 1.1252 1.0960 1.1369 1.0994 1.4484 1.0980 1.5017 1.3406 1.2722 1.5391 1.8866 5.4815 4.8353 4.3153 6.2238 1.0410 1.0662 1.0631 1.0972 1.0613 1.0614 1.0592 1.0584 1.0607 1.0618 1.0957 1.0921 1.0937 1.1032 1.1033 1.0881 1.0961 1.1115 1.1120 1.1115 1.1113 1.0927 1.0753 1.0748
irintensity: 0.0120 0.0194 0.0625 0.4068 0.3445 1.0334 0.2906 0.3772 2.0881 1.0576 3.5252 7.1192 3.7305 7.8177 3.3454 2.2431 2.1432 2.0544 0.2737 0.0332 1.1915 2.5304 0.3471 2.8293 5.3128 11.3367 3.5033 0.8261 5.7971 5.4035 12.1705 0.3524 18.1193 13.7915 11.6608 6.9436 1.0478 29.5878 11.1272 23.1905 1.1283 92.1902 26.7002 20.3367 42.5911 11.3597 3.1692 64.6168 32.7877 27.7823 23.2310 96.4183 29.6306 0.4610 3.5671 1.4104 22.3891 12.7056 8.2959 1.2775 52.7535 0.8550 1.4004 0.7364 33.8618 12.1724 40.2166 21.9353 0.6172 2.0352 0.6392 0.6189 0.9759 5.2834 1.2577 1.1470 0.6061 1.6773 11.1914 56.2883 40.1619 268.4833 63.9404 83.8059 205.6848 18.3303 16.4098 34.3088 39.7219 64.2377 70.8841 51.8237 33.9580 20.1139 45.3994 31.6636 30.2073 44.2824 15.7856 37.8750 6.0340 23.1254 4.5617 246.4564 0.5685 238.1274 2.0220 13.0105 37.6299 15.3222 72.7716 37.1422 275.3597 50.0774 111.8220 287.3914 151.3986 203.4880 419.6980 252.5115 255.2433 72.9008 100.6126 53.6899 19.0828 17.3933 22.7307 16.9669 15.6172 5.0389 10.1218 26.6058 16.8414 13.7427 14.2668 18.6822 3.1607 2.5452 18.1609 22.7606 14.9979 12.8439 7.2365 6.0949 23.2943 10.2863 18.3226
temp: 298.150 k
press: 1.00000 atm
elementType: 17 17 17 17 8 8 7 7 7 7 6 6 6 6 6 6 6 6 6 6 6 6 6 6 6 6 6 1 1 1 1 1 1 1 1 1 1 1 1 1 1 1 1 1 1 1 1 1 1 1 1
symmnumber: 1
zpe: 1049720.5 jmol-1
zpe.correction: 0.399817 hartree
zpe.thermalcorrener: 0.429404 hartree
zpe.thermalcorrenthalpy: 0.430348 hartree
zpe.thermalcorrgfe: 0.332354 hartree
zpe.sumelectzpe: -2869.884281 hartree
zpe.sumelectthermal: -2869.854694 hartree
zpe.sumelectthermalent: -2869.853750 hartree
zpe.sumelectthermalfe: -2869.951744 hartree
dipole: -0.6867 -5.8258 -1.3001
dipole: 6.0084
quadrupole: -186.1914 -213.2793 -187.1886
quadrupole: -1.0702 -1.0608 3.3328
quadrupole: 9.3617 -17.7262 8.3645 -1.0702 -1.0608 3.3328
hfenergy: -2870.284098 hartree
pointgroup: C01 [X(C17H24Cl4N4O2)]
dipole: 0.2506107 -2.3238408 0.3535333 debye
polarizability: 362.7914248|-6.6859577|328.1316304|2.7980053|-11.4460889|149.8561091 unknown
InChI: InChI=1S/C17H24Cl4N4O2/c1-13-2-3-14(22-16(26)24(8-4-18)9-5-19)12-15(13)23-17(27)25(10-6-20)11-7-21/h2-3,12,22-23H,4-11H2,1H3
charge 0 multiplicity 1
51 atoms
Cl 7.040432 -1.884919 -0.189198
Cl 4.551289 5.047133 -0.147814
Cl -6.905298 -2.207676 -1.22917
Cl -5.285897 4.559497 1.214717
O  1.729635 1.32649 -0.59067
O  -2.021948 1.328162 0.193742
N  3.997083 0.938577 -0.2148
N  -4.263498 0.687724 0.138266
N  2.425336 -0.810944 0.131373
N  -2.557931 -0.965667 0.278494
C  1.179478 -1.490573 0.273272
C  -1.25966 -1.552711 0.357852
C  1.251844 -2.899449 0.519712
C  5.121934 0.114321 0.258586
C  4.274986 2.316813 -0.682153
C  -5.339322 -0.318791 0.129031
C  -4.63103 2.118086 0.015615
C  -0.06307 -0.814482 0.191027
C  2.64407 0.522507 -0.242802
C  -2.879548 0.395787 0.202767
C  -1.210721 -2.95071 0.598884
C  0.035825 -3.599107 0.676274
C  5.687127 -0.76075 -0.878901
C  4.019705 3.333326 0.443067
C  2.582442 -3.628702 0.607945
C  -5.566726 -0.875313 -1.290791
C  -4.665892 2.784766 1.400466
H  5.921337 0.775913 0.635333
H  4.824557 -0.516882 1.117512
H  5.325434 2.375113 -1.017546
H  3.61822 2.550902 -1.535637
H  -6.271681 0.151475 0.486608
H  -5.134879 -1.145109 0.83702
H  -5.620061 2.193164 -0.469654
H  -3.887333 2.631945 -0.614744
H  -0.096436 0.25699 -0.002642
H  3.240911 -1.394501 0.312591
H  -3.322318 -1.639372 0.332585
H  -2.135883 -3.52627 0.728393
H  0.06689 -4.678422 0.864193
H  4.932891 -1.431632 -1.317451
H  6.162316 -0.159928 -1.667896
H  2.949821 3.407113 0.680401
H  4.619083 3.1299 1.343665
H  3.171968 -3.547115 -0.328272
H  3.218471 -3.25984 1.439877
H  2.422541 -4.704067 0.790019
H  -5.936024 -0.104003 -1.982292
H  -4.672874 -1.363223 -1.7070
H  -5.369169 2.294193 2.090664
H  -3.659526 2.854959 1.835276
