program: Gaussian 09
title: 000246380
version: EM64L-G09RevD.01
frameworkgroup: C1[X(C14H24Cl4N2O2)]
method: RPBEPBE
basis: SDD
operation: Freq
keyword: #p
keyword: freq=noraman
keyword: PBEPBE/SDD
title: #p freq=noraman PBEPBE/SDD
converged: YES YES NO NO
title: Mulliken charges:
elementType: Cl Cl Cl Cl O O N N C C C C C C C C C C C C C C H H H H H H H H H H H H H H H H H H H H H H H H
charge: 0.001066 0.025084 0.025143 0.001013 -0.241026 -0.241020 -0.311723 -0.311721 -0.384188 -0.384187 -0.374444 -0.374453 -0.376042 -0.376092 -0.374192 -0.374055 -0.408036 -0.408046 0.370031 0.369953 -0.701949 -0.701866 0.193685 0.195410 0.195416 0.193672 0.192142 0.198515 0.192132 0.198538 0.186137 0.208522 0.208484 0.186149 0.207511 0.238379 0.207498 0.238275 0.256421 0.215456 0.215477 0.256446 0.324560 0.324547 0.358691 0.358681
chargesum: 0.00000
title: Mulliken charges with hydrogens summed into heavy atoms:
elementType: Cl Cl Cl Cl O O N N C C C C C C C C C C C C C C
charge: 0.001066 0.025084 0.025143 0.001013 -0.241026 -0.241020 0.012837 0.012826 0.004907 0.004901 0.016213 0.016218 0.018617 0.018542 0.071698 0.071718 0.063841 0.063878 0.370031 0.369953 -0.343257 -0.343184
polarizability: 2.38128826e+02 -2.05982859e+00 1.98702521e+02 -1.08655626e+01 -2.47952221e+00 1.89081227e+02
1716.lowfreq: -6.0062 -5.0138 -3.4274 -0.0010 0.0019 0.0026 6.6662 8.9238 10.9474
frequency: -5.0143 8.9232 10.7617 11.3429 14.5742 29.2362 36.8294 38.2560 47.3604 48.8616 67.0881 98.5068 103.0506 103.4140 121.9098 139.1667 142.9533 166.2372 166.8606 180.4346 185.4798 206.7962 218.7120 235.0847 242.1899 280.5940 289.8852 334.2577 342.5289 377.6399 378.5032 418.7522 447.8169 491.8157 517.5174 568.4784 569.1704 604.4432 605.9168 641.3824 641.7883 681.2832 681.4206 721.3503 726.9195 738.5211 746.5212 750.7077 771.9925 804.1659 828.6281 862.5787 890.8843 899.8338 915.0080 951.0547 984.1617 1000.8357 1013.9795 1022.8116 1053.0553 1069.6942 1079.5470 1080.5596 1099.7308 1099.8520 1109.1658 1140.6781 1144.9304 1185.7771 1185.8305 1196.0690 1199.4793 1204.9287 1205.4116 1230.9977 1238.5734 1245.4649 1250.5212 1267.8961 1268.4506 1278.6371 1286.2322 1288.3870 1292.1588 1296.6667 1305.5056 1326.3628 1343.9666 1348.0641 1352.7518 1356.5559 1365.3408 1365.3925 1453.5354 1453.6666 1457.7987 1458.4726 1460.5351 1462.9227 1464.1417 1472.9063 1481.0528 1486.3291 1500.3756 1500.4268 1626.7740 1626.9509 2948.4010 2949.1725 2951.2024 2951.5637 2958.0130 2964.3448 2980.5085 2980.6600 2984.4893 2990.1483 2997.0410 3006.4433 3007.4643 3009.9507 3024.4769 3037.7774 3049.4468 3050.8480 3076.0214 3076.0733 3164.9661 3165.0481 3537.3941 3537.4489
redmass: 7.3140 6.9665 13.0947 20.7545 14.9242 6.4117 9.5722 7.7803 1.6623 5.3642 4.1906 1.6858 3.7790 4.7902 3.6977 1.9830 2.7357 5.2334 3.3583 3.5226 3.9175 8.8165 9.0498 10.2902 5.7147 3.3934 4.4387 2.5919 3.4255 14.2601 13.3155 3.2094 3.2207 2.3776 2.4010 1.5003 1.5520 3.8363 3.5983 4.5135 4.5077 5.4370 5.4481 1.0632 1.1226 1.5282 5.0563 3.2856 1.5247 1.7423 1.8285 1.6296 3.1957 2.9419 1.6906 2.1499 1.7469 2.6700 3.5536 1.4468 3.3392 2.7795 2.0604 2.6050 3.2899 3.3656 3.7851 1.9247 1.5976 1.0730 1.0729 1.2452 1.2712 1.2807 1.5362 1.4023 1.4122 1.7488 1.8074 1.2691 1.4116 1.0293 1.1544 1.2599 1.0864 1.1083 1.2114 1.2946 1.3823 1.3920 1.4443 1.7007 1.4156 1.4575 1.1073 1.1064 1.0770 1.0849 1.0675 1.0668 1.0850 1.0989 1.1029 1.1030 1.8581 1.8595 8.0102 8.0287 1.0590 1.0589 1.0590 1.0595 1.0600 1.0590 1.0642 1.0631 1.0939 1.0949 1.0979 1.0740 1.0623 1.0888 1.1030 1.1035 1.1015 1.1020 1.1050 1.1050 1.0897 1.0897 1.0781 1.0781
irintensity: 0.9499 1.0969 0.0242 0.6745 0.0013 0.6196 0.0208 14.7304 0.0002 2.3092 0.0000 0.2271 2.2493 0.0175 0.0000 0.0000 1.9979 5.4238 0.0017 7.0448 0.0000 0.0000 3.8095 0.0000 6.0828 9.2929 0.0001 0.0006 23.2047 0.0008 9.5600 0.0000 1.9337 29.5863 0.0001 35.4339 1.1821 355.6122 0.0468 0.3497 62.5245 132.7493 11.2673 16.0848 0.0000 30.7007 0.0004 48.5987 0.0001 16.7849 0.0000 3.3334 0.0000 4.1247 0.0000 1.3658 0.0000 1.0186 0.0000 1.3319 0.0000 4.1317 0.0000 14.1407 0.0304 15.3863 0.0000 0.0002 7.0265 20.1081 5.0114 25.4881 0.0005 11.3896 0.0045 0.0001 7.9083 19.0029 0.0002 0.0118 40.7161 0.0000 0.3168 0.0002 2.0479 0.0000 28.1816 0.0000 7.4649 0.0000 1.6808 0.0000 0.2867 10.7067 55.8765 3.8988 0.0007 4.4459 5.5004 0.0001 0.0000 5.2500 0.0000 33.0870 290.5680 5.0281 434.8081 0.3851 0.0002 12.6374 0.0001 3.0080 0.0000 152.9505 1.4721 72.1748 0.0001 12.6843 0.0001 52.2409 0.0007 13.5131 0.0000 49.0945 0.0161 216.4160 12.9723 28.7560 0.7066 0.6959 24.0157 41.2893
temp: 298.150 k
press: 1.00000 atm
elementType: 17 17 17 17 8 8 7 7 6 6 6 6 6 6 6 6 6 6 6 6 6 6 1 1 1 1 1 1 1 1 1 1 1 1 1 1 1 1 1 1 1 1 1 1 1 1
symmnumber: 1
zpe: 970139.2 jmol-1
zpe.correction: 0.369507 hartree
zpe.thermalcorrener: 0.396026 hartree
zpe.thermalcorrenthalpy: 0.396970 hartree
zpe.thermalcorrgfe: 0.302976 hartree
zpe.sumelectzpe: -2646.345156 hartree
zpe.sumelectthermal: -2646.318637 hartree
zpe.sumelectthermalent: -2646.317692 hartree
zpe.sumelectthermalfe: -2646.411687 hartree
dipole: 0.0059 -0.0069 0.0004
dipole: 0.0091
quadrupole: -198.4118 -162.0693 -167.2269
quadrupole: -4.2921 -27.7647 11.4267
quadrupole: -22.5092 13.8334 8.6757 -4.2921 -27.7647 11.4267
hfenergy: -2646.7146628 hartree
pointgroup: C01 [X(C14H24Cl4N2O2)]
dipole: -0.0024879 0.0025733 0.0002555 debye
polarizability: 236.215816|-1.4616696|197.8363156|14.3990254|3.883112|191.860442 unknown
InChI: InChI=1S/C14H24Cl4N2O2/c15-11(16)13(21)19-9-7-5-3-1-2-4-6-8-10-20-14(22)12(17)18/h11-12,19-20H,1-10H2
charge 0 multiplicity 1
46 atoms
Cl -8.024355 -1.278001 -2.107924
Cl -6.182081 -2.423846 0.072864
Cl 6.217451 2.345587 -0.116473
Cl 8.053659 1.202793 2.070991
O  -7.181166 0.802336 1.123647
O  7.214162 -0.884027 -1.157626
N  -6.066181 0.83709 -0.933455
N  6.09576 -0.912983 0.897735
C  -0.634304 0.032975 -0.431055
C  0.66355 -0.106743 0.396063
C  -1.699355 0.919893 0.251791
C  1.728372 -0.99414 -0.286513
C  -2.999248 1.057394 -0.572594
C  3.028338 -1.131515 0.537786
C  -4.060986 1.932431 0.128252
C  4.089453 -2.007903 -0.162314
C  -5.363923 2.11285 -0.686405
C  5.392354 -2.188418 0.652387
C  -6.888516 0.278805 0.005675
C  6.920277 -0.357725 -0.041283
C  -7.46315 -1.10891 -0.317505
C  7.495996 1.030047 0.279766
H  -0.388594 0.454653 -1.428251
H  -1.06123 -0.974992 -0.61587
H  1.090687 0.901192 0.580568
H  0.417775 -0.528072 1.393391
H  -1.273421 1.928316 0.436693
H  -1.943962 0.497757 1.248645
H  1.30223 -2.002577 -0.470866
H  1.972934 -0.572543 -1.283605
H  -2.756453 1.490406 -1.566501
H  -3.417327 0.046826 -0.75846
H  3.446975 -0.120974 0.722558
H  2.785462 -1.563385 1.53217
H  -3.643552 2.940906 0.324267
H  -4.318949 1.499391 1.113733
H  3.671307 -3.016288 -0.357286
H  4.347585 -1.576007 -1.14826
H  -6.056235 2.774769 -0.136271
H  -5.145533 2.573836 -1.6673
H  5.17369 -2.648076 1.633853
H  6.084084 -2.851518 0.102966
H  -5.924359 0.341878 -1.816794
H  5.95302 -0.41559 1.779703
H  -8.33363 -1.322394 0.312395
H  8.368092 1.24089 -0.348792
