program: Gaussian 09
title: 000246338
version: EM64L-G09RevD.01
frameworkgroup: C1[X(C7H11NO)]
method: RPBEPBE
basis: SDD
operation: Freq
keyword: #p
keyword: freq=noraman
keyword: PBEPBE/SDD
title: #p freq=noraman PBEPBE/SDD
converged: YES YES NO NO
title: Mulliken charges:
elementType: O N C C C C C C C H H H H H H H H H H H
charge: -0.268665 -0.077765 -0.450998 -0.455625 -0.005402 -0.017737 -0.046449 -0.565376 -0.570791 0.222296 0.242727 0.268830 0.214420 0.224205 0.238970 0.168070 0.223146 0.217062 0.222129 0.216952
chargesum: 0.00000
title: Mulliken charges with hydrogens summed into heavy atoms:
elementType: O N C C C C C C C
charge: -0.268665 -0.077765 0.014025 0.027625 0.218803 0.221234 0.121621 -0.125168 -0.131711
polarizability: 1.01973305e+02 -5.63709011e+00 9.47601719e+01 3.20773663e+00 -3.16580979e+00 6.09480609e+01
1716.lowfreq: -15.5478 -12.9659 -0.0006 -0.0004 0.0004 3.2635 35.6546 56.2103 65.8434
frequency: 35.3219 56.1099 65.7690 85.4103 126.8321 233.4979 255.6178 297.7911 340.2111 398.7153 410.4118 468.0266 573.8695 643.4260 701.4893 843.5603 906.1574 916.1108 938.6478 952.5096 954.1330 962.1739 974.1594 998.6962 1007.4044 1108.4372 1109.9902 1175.1057 1203.4032 1258.2423 1283.7017 1286.5175 1326.0073 1334.0107 1379.9524 1390.4240 1426.2258 1429.8221 1458.0168 1461.3742 1620.9049 1655.1849 1658.2900 2936.7516 2982.1497 2987.0100 3045.6090 3048.3982 3085.7823 3086.4308 3102.8061 3107.3799 3197.4200 3198.2379
redmass: 3.1195 3.2778 2.4563 2.9500 2.5946 2.4358 4.0009 2.5724 2.5448 2.2300 2.0966 2.2003 1.8398 1.8920 2.6359 3.0508 1.4833 1.4707 2.1079 1.3354 1.3832 1.5837 2.1381 1.1897 1.1930 1.9357 1.9244 2.9741 1.6772 1.3306 1.2390 1.2579 1.2453 1.2709 1.3070 2.1921 1.1870 1.1874 1.0916 1.1122 6.4220 4.6063 4.6694 1.0860 1.0593 1.0606 1.1013 1.1012 1.0604 1.0610 1.0940 1.0949 1.1140 1.1142
irintensity: 0.4709 1.4382 0.6077 1.3766 0.7542 3.5309 10.4480 6.3572 4.8988 11.6799 3.3082 18.2426 5.9288 7.5560 22.3098 4.3018 16.4253 6.5965 9.7469 69.8936 75.9332 6.4520 43.7833 8.0649 18.2296 12.8441 49.0078 12.4683 37.2803 20.2532 0.2621 1.9026 2.9775 10.8726 19.6039 59.0958 5.7527 12.8579 40.7198 3.2808 370.7124 19.2759 10.7323 85.8746 36.2032 18.6755 10.0559 8.0708 8.2799 17.6945 7.4910 10.3759 21.3520 26.2153
temp: 298.150 k
press: 1.00000 atm
elementType: 8 7 6 6 6 6 6 6 6 1 1 1 1 1 1 1 1 1 1 1
symmnumber: 1
zpe: 433584.3 jmol-1
zpe.correction: 0.165144 hartree
zpe.thermalcorrener: 0.175631 hartree
zpe.thermalcorrenthalpy: 0.176575 hartree
zpe.thermalcorrgfe: 0.127663 hartree
zpe.sumelectzpe: -402.566392 hartree
zpe.sumelectthermal: -402.555904 hartree
zpe.sumelectthermalent: -402.554960 hartree
zpe.sumelectthermalfe: -402.603872 hartree
dipole: -1.0139 -4.0761 -0.8243
dipole: 4.2804
quadrupole: -50.8493 -67.9530 -51.8563
quadrupole: -3.3051 0.2214 -3.7766
quadrupole: 6.0369 -11.0668 5.0299 -3.3051 0.2214 -3.7766
hfenergy: -402.7315357 hartree
pointgroup: C01 [X(C7H11N1O1)]
dipole: 0.689544 -1.5078083 0.2950789 debye
dipolederiv: -0.6359356 0.5001483 -0.0901528 0.2352284 -1.1391116 0.0269046 -0.1699047 0.2508529 -0.4208175 -0.6077711 -0.2469447 -0.0008753 0.2662046 -1.2068947 0.0056419 0.0543456 -0.0819888 -0.3725086 0.4555612 -0.1630398 0.0130474 -0.317726 0.2681117 -0.0650646 0.0147467 -0.1342217 0.2275153 0.430848 0.2959042 0.0611151 0.1190005 0.0641697 0.089433 0.1071741 0.1722758 0.2897735 0.1281409 0.0387507 -0.0220813 0.0324955 -0.2077033 0.1208906 -0.0751602 0.130888 0.0688591 -0.0518806 0.0684864 -0.1846396 0.0789678 0.1805197 0.0468065 -0.241195 -0.0666767 -0.0326649 0.4925841 -0.3310073 0.2507108 -0.4135178 1.8808804 0.0101527 0.233748 -0.03892 0.28316 -0.1841296 0.0511332 -0.024234 0.0332852 -0.3413905 0.1391734 -0.0088762 0.11504 0.0750966 -0.2535699 0.0172465 -0.2333279 0.0004671 -0.1909545 0.0563523 -0.2280835 0.0828106 -0.0665322 -0.0134307 0.0139746 -0.0897126 -0.0014433 0.0550681 -0.1113629 -0.0441355 -0.0380753 -0.0726358 0.0135905 -0.0421593 0.0647117 0.0133577 -0.07249 0.0459803 0.0491514 0.01818 0.0911189 0.0132756 -0.0364112 -0.0294073 0.0969891 0.090777 0.0909165 -0.0073 0.0246027 0.0967417 0.0011866 -0.0354599 0.0913132 0.0049671 -0.0057676 -0.1425568 0.0637737 -0.0960598 -0.0497824 0.0460798 -0.0314292 -0.0567832 -0.0408785 0.132688 -0.0722713 -0.0035579 -0.0737476 -0.0883757 0.0891917 0.0075677 0.0982723 0.0201113 0.0241159 -0.0751913 0.1380689 -0.0231104 -0.0128315 -0.1275427 -0.0657583 -0.1744651 -0.0114219 0.0460746 0.0001343 -0.1876001 -0.0718344 -0.0059626 -0.0443624 0.0262522 0.0852894 0.0027133 0.186403 -0.0528273 0.1068301 -0.0505556 0.0112444 0.0827493 -0.009132 -0.0055652 -0.0226016 0.1525113 -0.0875376 -0.0514105 -0.0800023 -0.0836162 0.0643437 -0.0910358 0.1134759 -0.1064172 0.013988 0.0301333 0.1245049 0.0502157 0.0700278 0.1010709 0.0329137 0.1333086 0.0102187 0.069005 -0.0557076 0.1248803 -0.0896729 -0.0078099 unknown
polarizability: 99.170597|6.201563|96.801949|4.7057786|5.5792877|61.7089921 unknown
InChI: InChI=1S/C7H11NO/c1-3-5-8(7-9)6-4-2/h3-4,7H,1-2,5-6H2
charge 0 multiplicity 1
20 atoms
O  -0.791682 2.676212 -0.115003
N  -0.043112 0.46297 0.152733
C  1.002553 -0.437206 0.696126
C  -1.126614 -0.110258 -0.683953
C  2.164196 -0.641264 -0.261762
C  -2.052654 -1.005427 0.115873
C  0.02843 1.832658 0.346889
C  3.466329 -0.4572 0.066428
C  -2.288105 -2.312265 -0.161902
H  1.373551 -0.031005 1.655313
H  0.51703 -1.407067 0.920591
H  -1.681169 0.757944 -1.088556
H  -0.691636 -0.670749 -1.53419
H  1.899592 -0.961453 -1.280234
H  -2.555792 -0.522421 0.966168
H  0.900455 2.123054 0.976147
H  4.271178 -0.626872 -0.656983
H  3.767625 -0.133544 1.071081
H  -2.986491 -2.910105 0.433854
H  -1.801084 -2.817604 -1.006118
