program: Gaussian 09
title: 000246360
version: EM64L-G09RevD.01
frameworkgroup: C1[X(C20H14N2O4)]
method: RPBEPBE
basis: SDD
operation: Freq
keyword: #p
keyword: freq=noraman
keyword: PBEPBE/SDD
title: #p freq=noraman PBEPBE/SDD
converged: YES YES NO NO
title: Mulliken charges:
elementType: O O O O N N C C C C C C C C C C C C C C C C C C C C H H H H H H H H H H H H H H
charge: -0.420328 -0.224313 -0.211612 -0.198292 -0.326929 0.018964 -0.104137 0.344614 0.057860 0.427206 0.044764 0.443229 -0.381490 -0.360307 -0.361373 -0.394993 -0.213617 -0.496133 -0.220177 -0.313009 -0.227408 -0.219653 0.392201 -0.213459 -0.238343 -0.392911 0.263704 0.275309 0.364114 0.248780 0.279017 0.236438 0.354304 0.239600 0.307068 0.233421 0.229860 0.236856 0.233446 0.287728
chargesum: 0.00000
title: Mulliken charges with hydrogens summed into heavy atoms:
elementType: O O O O N N C C C C C C C C C C C C C C C C C C C C
charge: -0.056214 -0.224313 -0.211612 -0.198292 -0.326929 0.018964 -0.104137 0.344614 0.057860 0.427206 0.044764 0.443229 -0.117786 -0.084998 -0.112593 -0.115976 0.022822 -0.141829 0.019423 -0.005942 0.006013 0.010208 0.392201 0.023397 -0.004896 -0.105183
polarizability: 3.19611696e+02 -1.35283187e+01 2.69127431e+02 -1.09430835e+01 -3.00909644e+01 1.60711272e+02
1716.lowfreq: -5.9677 -0.0008 -0.0007 0.0006 1.5437 4.3287 16.3059 40.4568 42.1908
frequency: 16.2372 40.4003 42.1304 53.3941 56.0346 70.4132 90.7794 136.4193 158.1541 170.6024 176.3575 207.1167 223.7225 253.3731 271.8830 286.6781 322.1952 330.1452 343.5665 369.5801 375.5349 400.7485 403.3787 422.7977 429.8449 470.1472 494.6701 516.1893 537.9233 546.8543 582.6941 598.5884 615.6664 642.9410 659.3912 674.0054 679.8777 687.2089 693.2200 706.7199 709.3383 758.6065 769.4720 781.9192 791.5475 808.8664 837.9267 861.7878 884.6258 892.4207 904.5659 928.0803 937.8650 958.0625 968.3430 983.4702 986.3418 988.1386 990.2763 995.2927 1003.2437 1003.9721 1013.5116 1024.3756 1039.3034 1078.6059 1085.6372 1096.4415 1102.4279 1117.0074 1157.8541 1170.7864 1175.1562 1185.2936 1191.0037 1194.1762 1216.7054 1237.6308 1278.0417 1284.7226 1308.0513 1323.2496 1339.9832 1374.2752 1383.6153 1388.0417 1408.4442 1437.0176 1445.0075 1453.6107 1462.1784 1481.4628 1486.4003 1579.5333 1594.1579 1611.7574 1613.3190 1615.6867 1621.6745 1638.0450 3129.3336 3136.9637 3137.7999 3149.2710 3150.4575 3152.9106 3161.4821 3163.3545 3173.1793 3174.1672 3191.5423 3197.2515 3200.9768 3555.4425
redmass: 7.6972 5.5848 5.2049 6.9331 5.6526 5.6496 7.4005 5.5028 5.6569 5.4642 6.4963 5.0050 5.6547 4.6841 8.2641 4.9598 5.2701 3.0500 2.9484 2.3607 4.5627 7.6610 2.8990 3.3564 3.6797 4.6796 4.7312 6.7818 7.5823 4.9287 5.3371 6.8070 6.4230 6.4662 8.0181 2.9710 4.1059 4.9253 6.8760 1.9528 5.2416 2.0970 3.0930 3.5617 2.0695 1.5054 6.0574 1.2489 4.4472 1.6879 2.8564 1.4869 1.5226 1.3952 1.4247 4.9758 4.4066 1.5549 5.3258 1.4259 1.3358 1.3396 2.2174 2.7093 3.8373 2.0367 1.6987 2.4813 1.9008 2.0565 1.8857 1.1498 1.0635 1.7743 1.2251 1.3745 5.4717 3.3523 1.7567 1.7368 1.6178 1.5547 2.4572 11.1644 9.0488 7.4673 7.8594 2.2065 3.1352 2.5093 2.6499 2.2916 2.6952 6.7383 6.3411 6.2142 7.5686 7.0005 7.3201 11.8804 1.0851 1.0885 1.0863 1.0937 1.0902 1.0895 1.0956 1.0970 1.1003 1.0986 1.0937 1.0921 1.0955 1.0659
irintensity: 0.2534 0.8095 0.1142 1.8599 0.6368 0.5107 0.7209 0.7779 0.8976 0.5919 0.6684 0.9326 0.7989 0.9848 2.9208 4.9066 3.3160 12.5227 48.9235 50.5267 25.1053 2.6183 1.2840 4.9515 3.5537 4.2010 2.4843 9.4032 2.4686 12.1260 4.7072 15.0576 0.1236 8.0795 20.1289 28.5739 4.0238 4.1369 7.9186 57.5917 26.4080 32.4048 39.6195 34.1583 28.1715 38.0396 14.2122 0.4960 29.7804 7.4806 45.3942 6.1546 13.9285 24.1483 4.9001 48.7497 11.3544 0.2562 1.9922 6.7253 0.0509 2.6834 10.0036 33.0642 29.3024 21.3540 6.3712 15.5562 17.8860 60.1596 52.7192 7.6121 0.5926 9.3126 19.1452 59.1460 253.0919 32.5628 58.7323 97.3678 21.7243 73.2283 269.5098 103.6224 1.8893 3.1524 3.1838 18.9578 9.1292 19.2607 1.3191 13.1100 212.7783 2.7630 0.7841 1.7307 0.4104 49.9156 14.4464 206.1890 1.0350 3.9693 1.0882 24.5355 5.8436 11.2710 7.4014 16.8276 23.6832 10.8765 2.5424 18.9232 2.5035 15.6157
temp: 298.150 k
press: 1.00000 atm
elementType: 8 8 8 8 7 7 6 6 6 6 6 6 6 6 6 6 6 6 6 6 6 6 6 6 6 6 1 1 1 1 1 1 1 1 1 1 1 1 1 1
symmnumber: 1
zpe: 773924.5 jmol-1
zpe.correction: 0.294772 hartree
zpe.thermalcorrener: 0.315564 hartree
zpe.thermalcorrenthalpy: 0.316509 hartree
zpe.thermalcorrgfe: 0.243703 hartree
zpe.sumelectzpe: -1179.080854 hartree
zpe.sumelectthermal: -1179.060062 hartree
zpe.sumelectthermalent: -1179.059118 hartree
zpe.sumelectthermalfe: -1179.131923 hartree
dipole: 8.7127 3.5463 -2.1825
dipole: 9.6567
quadrupole: -164.5402 -142.1940 -142.8535
quadrupole: -17.8817 6.3661 3.7567
quadrupole: -14.6776 7.6686 7.0090 -17.8817 6.3661 3.7567
hfenergy: -1179.3756261 hartree
pointgroup: C01 [X(C20H14N2O4)]
dipole: 3.2672425 -1.6649076 0.9936783 debye
polarizability: 321.4862856|9.4222695|263.3463235|9.6312022|-36.4621411|164.6177902 unknown
InChI: InChI=1S/C20H14N2O4/c23-19-17-11-4-5-12-18(17)20(24,14-7-2-1-3-8-14)21(19)15-9-6-10-16(13-15)22(25)26/h1-13,24H
charge 0 multiplicity 1
40 atoms
O  1.213573 -0.467742 2.212427
O  -0.249787 2.83718 -0.624341
O  -5.988543 0.845481 -0.422315
O  -4.47215 2.30503 -1.2958
N  0.054205 0.661212 0.352422
N  -4.779052 1.267965 -0.593288
C  1.217794 -0.206243 0.767884
C  2.414856 0.665471 0.380945
C  1.973632 1.884932 -0.164069
C  1.233144 -1.569813 0.063852
C  0.485787 1.908529 -0.196968
C  -1.303923 0.244907 0.506329
C  3.783984 0.389983 0.52804
C  2.876595 2.878305 -0.585803
C  0.845281 -1.666267 -1.294579
C  1.717058 -2.716456 0.737436
C  4.705173 1.383038 0.110319
C  -2.360576 0.968484 -0.108037
C  4.25823 2.613114 -0.441379
C  -1.614923 -0.914509 1.274073
C  0.932262 -2.901357 -1.970677
C  1.800473 -3.952968 0.058321
C  -3.679551 0.505859 0.060371
C  -2.949299 -1.345366 1.41372
C  1.41101 -4.04943 -1.296945
C  -4.00985 -0.642643 0.808849
H  4.129707 -0.562241 0.942639
H  2.506356 3.817324 -1.008986
H  1.377728 0.38616 2.689302
H  0.466826 -0.782726 -1.820798
H  2.005544 -2.635161 1.789112
H  5.780253 1.197894 0.209856
H  -2.170621 1.871307 -0.690205
H  4.993482 3.360029 -0.75897
H  -0.817475 -1.464305 1.775462
H  0.623561 -2.969092 -3.019441
H  2.16783 -4.839006 0.58783
H  -3.159835 -2.23946 2.009068
H  1.475906 -5.008409 -1.822662
H  -5.052768 -0.952709 0.904004
