program: Gaussian 09
title: 000246335
version: EM64L-G09RevD.01
frameworkgroup: C1[X(C11H20N3OP)]
method: RPBEPBE
basis: SDD
operation: Freq
keyword: #p
keyword: freq=noraman
keyword: PBEPBE/SDD
title: #p freq=noraman PBEPBE/SDD
converged: YES YES NO NO
title: Mulliken charges:
elementType: P O N N N C C C C C C C C C C C H H H H H H H H H H H H H H H H H H H H
charge: 1.230750 -0.640331 -0.441846 -0.427568 -0.553590 -0.005730 -0.019276 -0.454012 -0.446689 -0.703941 -0.707448 -0.372594 -0.331145 -0.405122 -0.187003 -0.191253 0.251582 0.267711 0.240080 0.264917 0.237356 0.254766 0.226697 0.212376 0.229759 0.214059 0.229626 0.223919 0.210648 0.265241 0.260899 0.219753 0.202869 0.223238 0.207127 0.214175
chargesum: 0.00000
title: Mulliken charges with hydrogens summed into heavy atoms:
elementType: P O N N N C C C C C C C C C C C
charge: 1.230750 -0.640331 -0.441846 -0.427568 -0.553590 0.245851 0.248436 0.050985 0.045434 -0.035109 -0.039845 0.103295 0.149507 0.020984 0.020124 0.022923
polarizability: 1.82696956e+02 2.57617807e+00 1.61770514e+02 -7.69177471e+00 -2.36117016e+00 1.39405703e+02
1716.lowfreq: -8.1172 -0.0015 0.0009 0.0010 2.9122 11.6036 21.8918 29.8792 40.3609
frequency: 21.0377 29.4878 40.3126 44.9719 64.8645 95.7880 104.3217 152.5637 163.3166 176.8936 191.8998 202.1187 226.8489 247.1124 270.2887 283.5527 313.0848 330.3148 378.8299 390.8039 393.6687 405.1581 451.2323 481.7295 505.2946 548.5400 609.2847 653.2537 673.1631 740.1344 755.4252 766.5968 835.8464 841.6611 871.9914 896.1722 897.6840 921.1735 950.5174 962.8220 967.4988 972.7412 976.0522 995.2986 1009.3710 1026.4779 1031.0743 1056.5565 1066.2054 1070.7589 1097.9788 1114.4131 1118.9933 1134.1584 1138.1569 1139.2415 1164.2913 1168.8433 1192.6761 1222.5693 1238.2991 1239.3848 1246.6553 1303.6343 1331.3216 1339.0002 1367.8097 1374.8506 1376.4689 1381.0381 1397.3936 1398.0732 1451.4110 1454.6480 1456.2241 1462.0746 1463.7611 1464.5169 1471.6037 1473.0394 1473.8965 1677.0012 2912.3663 2947.6356 2970.3239 2983.4455 2984.0076 3017.0034 3021.2125 3060.5992 3066.3746 3068.2056 3072.2111 3073.1799 3074.8523 3076.0055 3099.2745 3099.6481 3100.7117 3132.6233 3178.2117 3181.0998
redmass: 3.1003 3.6490 3.4993 3.4209 3.0681 3.1734 3.8254 2.9573 3.0475 1.6208 1.2461 1.7788 2.9093 3.2648 3.3680 4.1824 4.2331 4.0358 2.5728 2.1467 2.2524 3.1810 4.3194 5.1135 3.5597 5.7756 7.8973 1.2110 5.9819 4.2014 3.9032 1.7977 3.9690 3.7193 3.6822 1.2366 1.2591 2.8119 1.8191 2.6429 1.7445 2.0093 2.0998 2.5996 2.3057 1.3870 1.3807 1.9918 1.3889 1.4025 1.8193 1.2976 1.2947 1.6108 1.4766 1.4768 1.8152 1.7501 1.1455 1.2424 1.7734 1.9257 1.7291 1.5084 1.3821 1.2420 1.6118 1.5040 1.4523 1.5020 1.5018 1.4865 1.0921 1.1217 1.1005 1.0825 1.1298 1.1006 1.0778 1.0466 1.0464 6.4338 1.0698 1.0686 1.0599 1.0359 1.0359 1.0890 1.0993 1.0959 1.0569 1.0598 1.0857 1.0862 1.0984 1.0986 1.0985 1.0987 1.0843 1.0997 1.1173 1.1175
irintensity: 0.7253 0.2409 0.9443 1.2579 0.5621 1.4384 0.2859 8.7727 7.6644 1.7718 0.6258 2.8216 2.2535 9.8915 6.5199 2.3781 7.4100 7.5932 0.4390 7.0331 3.1880 0.8664 11.8734 21.2637 7.3290 25.0385 104.7558 44.1013 50.3833 8.2450 11.6805 14.1657 165.8428 86.4877 9.1429 4.4772 2.9450 35.6462 38.3263 95.0845 4.5995 46.0188 29.1364 40.7996 48.2308 28.6522 57.6084 7.0396 4.5216 5.3460 76.3676 3.2871 16.9049 19.2235 9.8130 8.0406 3.7469 8.9850 17.9620 1.7323 37.3417 33.2096 14.5681 13.0918 6.3487 0.7589 7.2738 9.5742 9.6141 1.4680 36.3067 31.0273 9.8311 12.7128 7.8671 22.9389 11.6601 3.6541 6.7517 9.2308 10.8720 5.4341 57.9790 59.9446 41.2444 33.0129 26.9319 3.9170 47.6805 5.2445 15.2896 19.1918 5.6019 3.6310 34.2452 32.3341 25.5540 31.6738 9.1786 59.6131 8.3545 6.9284
temp: 298.150 k
press: 1.00000 atm
elementType: 15 8 7 7 7 6 6 6 6 6 6 6 6 6 6 6 1 1 1 1 1 1 1 1 1 1 1 1 1 1 1 1 1 1 1 1
symmnumber: 1
zpe: 786629.7 jmol-1
zpe.correction: 0.299611 hartree
zpe.thermalcorrener: 0.317922 hartree
zpe.thermalcorrenthalpy: 0.318867 hartree
zpe.thermalcorrgfe: 0.251462 hartree
zpe.sumelectzpe: -1010.493279 hartree
zpe.sumelectthermal: -1010.474968 hartree
zpe.sumelectthermalent: -1010.474024 hartree
zpe.sumelectthermalfe: -1010.541429 hartree
dipole: 0.4378 0.1668 -1.4398
dipole: 1.5140
quadrupole: -92.9382 -94.7269 -111.8093
quadrupole: -0.1890 -1.9223 -0.4465
quadrupole: 6.8866 5.0979 -11.9845 -0.1890 -1.9223 -0.4465
hfenergy: -1010.7928904 hartree
pointgroup: C01 [X(C11H20N3O1P1)]
dipole: -0.1457873 -0.0865822 -0.5710303 debye
polarizability: 180.6290036|6.1790273|163.4010893|7.9450799|4.4231257|139.8430804 unknown
InChI: InChI=1S/C11H20N3OP/c1-10-8-13(10)16(15,14-9-11(14)2)12-6-4-3-5-7-12/h3-4,10-11H,5-9H2,1-2H3
charge 0 multiplicity 1
36 atoms
P  -0.414201 -0.12688 0.584353
O  -0.622529 -0.22775 2.180629
N  -1.118382 1.293658 -0.242191
N  -1.148209 -1.440039 -0.398512
N  1.243584 -0.089103 0.125156
C  -2.513855 1.756254 0.144362
C  -1.117032 -2.841958 0.195061
C  -1.297899 2.548561 0.592672
C  -2.426434 -2.078443 0.124396
C  -3.405814 2.203958 -0.996144
C  -0.776192 -3.962421 -0.766922
C  2.314267 -0.283011 1.123316
C  1.64813 0.038759 -1.289018
C  3.309974 0.897785 1.07108
C  2.955905 0.793275 -1.424229
C  3.699984 1.203765 -0.364482
H  -3.006463 1.183796 0.944552
H  -0.686185 -2.920787 1.204488
H  -1.027342 3.472183 0.070678
H  -1.024752 2.49516 1.654812
H  -3.155746 -2.320302 -0.65602
H  -2.837876 -1.706619 1.072121
H  -3.869714 1.33434 -1.495717
H  -4.212285 2.862803 -0.623464
H  -2.819151 2.756307 -1.750054
H  -1.151038 -4.930258 -0.384668
H  -1.229129 -3.77389 -1.755464
H  0.31751 -4.045115 -0.902127
H  2.85895 -1.22756 0.909506
H  1.846334 -0.371892 2.119491
H  0.846461 0.575689 -1.831788
H  1.740893 -0.961518 -1.771106
H  4.211517 0.64834 1.666049
H  2.854251 1.791301 1.543691
H  3.285615 1.000555 -2.451155
H  4.626552 1.767859 -0.536251
