program: Gaussian 09
title: 000246330
version: EM64L-G09RevD.01
frameworkgroup: C1[X(C15H12O6)]
method: RPBEPBE
basis: SDD
operation: Freq
keyword: #pfreq=noraman
keyword: PBEPBE/SDD
title: #p freq=noraman PBEPBE/SDD
converged: YES YES NO NO
title: Mulliken charges:
elementType: O O O O O O C C C C C C C C C C C C C C C H H H H H H H H H H H H
charge: -0.290286 -0.405120 -0.206759 -0.434593 -0.416571 -0.484301 -0.291157 -0.251842 0.563706 0.114263 0.203139 0.262485 -0.485776 -0.443256 -0.348589 -0.511653 0.184130 0.333575 -0.409196 -0.335509 0.129715 0.245176 0.279831 0.269560 0.232964 0.278014 0.285827 0.355098 0.230211 0.223059 0.385248 0.363695 0.374911
chargesum: 0.00000
title: Mulliken charges with hydrogens summed into heavy atoms:
elementType: O O O O O O C C C C C C C C C C C C C C C
charge: -0.290286 -0.050022 -0.206759 -0.049345 -0.052876 -0.109390 -0.045981 0.027989 0.563706 0.114263 0.203139 0.262485 -0.216216 -0.210291 -0.070576 -0.225826 0.184130 0.333575 -0.178985 -0.112449 0.129715
polarizability: 2.78440031e+02 -1.18606973e+01 1.86774863e+02 -4.31401470e-01 -1.47347796e+01 1.08653042e+02
1716.lowfreq: -11.0833 -2.4246 -0.0008 -0.0006 -0.0003 5.5847 13.7077 44.9235 51.7135
frequency: 12.9048 44.9134 51.7085 73.3813 99.1285 135.0319 161.4508 193.0206 211.8392 230.0803 235.1781 240.0306 263.6628 281.3738 287.2640 301.0696 317.5018 351.5613 372.4797 398.5012 434.1328 440.8768 452.9145 459.7807 482.1476 485.2212 528.3256 545.5409 567.6146 610.9136 619.7262 641.4117 666.7964 691.7976 713.2614 727.1651 747.0733 760.3223 764.1642 791.6065 802.1200 818.9213 849.1851 872.7325 894.4589 910.1986 921.7907 962.0915 968.5862 971.3509 1029.8769 1042.0023 1075.4137 1101.1524 1135.7658 1144.4289 1156.6809 1172.7093 1182.0851 1195.8268 1218.0952 1233.4212 1244.7807 1269.4006 1275.2411 1295.6329 1297.4974 1300.4230 1346.5184 1363.1401 1399.2855 1414.0688 1449.5225 1470.8428 1489.8055 1506.2782 1571.2325 1594.7041 1611.6632 1633.8534 1637.6591 2977.6047 3091.8830 3121.4872 3128.9836 3144.5595 3160.3808 3185.4316 3189.3473 3527.6436 3530.5276 3579.9780 3624.5608
redmass: 5.6347 6.6032 6.5383 6.9166 7.3943 6.5488 6.1561 6.4210 6.1367 4.0744 6.2471 4.2961 1.1885 5.1104 4.2602 6.0132 1.6364 6.4272 5.5595 1.1179 5.7257 2.9621 3.2511 5.8603 4.2868 1.1641 6.6192 6.4003 5.9007 5.5333 5.3607 5.9276 4.9609 4.0022 4.4793 6.7934 3.6162 4.4485 3.6588 1.7175 2.7642 2.2498 4.3525 1.5647 1.4860 1.3977 3.6941 3.1659 2.3663 1.7548 3.5281 6.2560 2.1462 1.8883 1.4014 1.2337 1.7415 1.5524 1.4018 1.3500 1.6046 1.6277 1.6204 2.7574 2.7889 1.8619 1.6653 1.4806 1.6609 1.3230 5.7016 5.5013 4.0484 3.2253 3.3779 3.4354 7.6784 9.8615 7.1489 6.7533 7.2680 1.0841 1.0872 1.0874 1.0892 1.0968 1.0956 1.0923 1.0930 1.0649 1.0659 1.0661 1.0666
irintensity: 2.0782 2.4229 1.7148 0.9354 2.5552 0.7150 0.7615 17.7982 2.5457 27.3444 2.1035 8.0559 152.9596 16.7202 11.7036 0.3955 134.1884 6.6731 9.1375 142.4463 13.7580 19.7130 8.4438 3.2749 10.0256 122.7246 22.4830 33.5948 0.6404 7.7684 6.6739 6.9484 10.1004 1.6746 2.2308 1.6677 34.0404 29.6262 34.0133 32.4512 19.6211 20.0180 7.6742 38.3811 5.9480 1.8210 8.4524 52.2014 115.0528 74.6054 86.1282 17.5482 184.9430 355.0952 36.9986 12.4429 23.6188 107.7811 67.3271 32.8003 22.4738 23.0216 34.3643 93.5483 161.9687 12.9130 116.7947 43.6331 37.4202 71.8393 117.1446 8.2744 101.9845 0.4307 0.2744 122.2939 49.6202 386.4903 39.1638 15.5975 251.5257 17.2018 9.8553 14.3727 10.3027 11.6360 6.9985 0.4415 0.2622 90.5937 8.7786 74.6764 69.9410
temp: 298.150 k
press: 1.00000 atm
elementType: 8 8 8 8 8 8 6 6 6 6 6 6 6 6 6 6 6 6 6 6 6 1 1 1 1 1 1 1 1 1 1 1 1
symmnumber: 1
zpe: 630944.6 jmol-1
zpe.correction: 0.240314 hartree
zpe.thermalcorrener: 0.258694 hartree
zpe.thermalcorrenthalpy: 0.259638 hartree
zpe.thermalcorrgfe: 0.193115 hartree
zpe.sumelectzpe: -1028.620327 hartree
zpe.sumelectthermal: -1028.601947 hartree
zpe.sumelectthermalent: -1028.601003 hartree
zpe.sumelectthermalfe: -1028.667526 hartree
dipole: -0.3234 -1.4077 -3.2907
dipole: 3.5937
quadrupole: -66.6146 -137.5603 -123.4335
quadrupole: -16.3247 9.5312 -8.2142
quadrupole: 42.5882 -28.3575 -14.2307 -16.3247 9.5312 -8.2142
hfenergy: -1028.8606408 hartree
pointgroup: C01 [X(C15H12O6)]
dipole: 0.119811 0.6837505 -1.2317364 debye
polarizability: 278.4722127|-11.5499467|182.9089167|-1.6541982|22.4402976|112.4868065 unknown
InChI: InChI=1S/C15H12O6/c16-8-2-3-9-12(6-8)21-15(14(20)13(9)19)7-1-4-10(17)11(18)5-7/h1-6,14-18,20H
charge 0 multiplicity 1
33 atoms
O  -0.517345 0.690192 -0.135963
O  0.075339 -1.534926 1.66325
O  -2.158167 -3.165848 -0.066587
O  4.102148 1.833634 1.5149
O  -4.807057 2.787085 -0.042958
O  5.861448 0.62483 -0.132187
C  0.254799 -0.503749 -0.610021
C  -0.185432 -1.730363 0.231262
C  1.728624 -0.174974 -0.522084
C  -1.692881 -1.992291 0.008361
C  -2.523064 -0.76869 -0.05555
C  -1.912106 0.524455 -0.097471
C  2.227244 0.713082 0.459933
C  2.622191 -0.813777 -1.414722
C  -3.941696 -0.841502 -0.03165
C  -2.683688 1.700275 -0.090156
C  3.609272 0.950788 0.551434
C  -4.088738 1.588742 -0.048712
C  -4.730098 0.316046 -0.027019
C  4.014342 -0.585797 -1.320026
C  4.502021 0.293394 -0.33712
H  -0.033925 -0.691658 -1.665604
H  0.390022 -2.626176 -0.050125
H  1.554597 1.244129 1.137118
H  2.240553 -1.49164 -2.186795
H  -4.396714 -1.837058 -0.000782
H  -2.206972 2.682031 -0.130848
H  -0.214228 -0.61974 1.919449
H  -5.824311 0.246616 0.000344
H  4.703873 -1.083583 -2.012793
H  5.092069 1.872512 1.439141
H  -5.782638 2.621831 -0.024024
H  6.459121 0.14393 -0.752594
