program: Gaussian 09
title: 000246329
version: EM64L-G09RevD.01
frameworkgroup: C1[X(C15H26N2O5)]
method: RPBEPBE
basis: SDD
operation: Freq
keyword: #p
keyword: freq=noraman
keyword: PBEPBE/SDD
title: #p freq=noraman PBEPBE/SDD
converged: YES YES NO NO
title: Mulliken charges:
elementType: O O O O O N N C C C C C C C C C C C C C C C H H H H H H H H H H H H H H H H H H H H H H H H H H
charge: -0.251896 -0.291327 -0.227599 -0.232636 -0.273631 -0.088540 -0.433999 -0.366100 -0.379067 -0.393365 -0.393005 -0.435064 -0.398685 0.177177 0.227321 0.212458 0.252163 -0.257128 -0.254496 -0.789234 -0.665779 -0.658967 0.221653 0.178511 0.176531 0.237079 0.260099 0.263747 0.197214 0.190902 0.191857 0.197762 0.211990 0.190113 0.348405 0.224453 0.240284 0.223125 0.238738 0.217284 0.250608 0.258251 0.216080 0.232006 0.249978 0.232818 0.253484 0.218423
chargesum: 0.00000
title: Mulliken charges with hydrogens summed into heavy atoms:
elementType: O O O O O N N C C C C C C C C C C C C C C C
charge: -0.251896 -0.291327 -0.227599 -0.232636 -0.273631 -0.088540 -0.085594 0.034063 0.034544 -0.005248 -0.003386 0.088782 0.003419 0.177177 0.227321 0.212458 0.252163 0.207609 0.207367 -0.063090 0.032284 0.045758
polarizability: 1.99247253e+02 2.21339735e+00 1.87563458e+02 6.69555743e+00 -2.86409044e+00 1.86599720e+02
1716.lowfreq: -19.9668 -13.5747 -9.6099 0.0002 0.0004 0.0007 9.6473 23.4968 28.3632
frequency: 7.8095 21.6278 25.7809 33.3884 42.1394 48.6881 53.4589 64.0920 80.2897 96.1495 104.2670 106.9901 109.3352 127.5922 150.8354 168.6172 195.8725 209.5788 218.7309 235.2559 254.2845 282.7950 290.8996 296.5038 308.4155 343.6591 352.5918 373.7947 383.6120 417.7808 439.6994 448.9115 453.5669 514.3929 532.4668 555.3475 575.8174 600.0031 616.8250 644.0875 718.8340 729.4314 752.4705 778.2101 799.9621 802.6234 815.5209 820.4726 837.8602 848.9261 853.8499 878.0809 909.7734 947.5235 958.5977 973.0438 993.2248 1004.4806 1007.7137 1017.4731 1040.0352 1041.4866 1046.0170 1085.1381 1094.5935 1097.4166 1101.3299 1116.9786 1136.8247 1146.2553 1156.2368 1156.8483 1159.7126 1160.5472 1166.7360 1235.7951 1258.1357 1267.4593 1272.6176 1275.9918 1279.3510 1293.7277 1305.8255 1331.1421 1336.0556 1337.7675 1348.8504 1352.1283 1354.0537 1362.7437 1381.8412 1384.2987 1389.8159 1391.3784 1448.5833 1449.6040 1456.4708 1457.4151 1458.8661 1459.4831 1461.3895 1461.4513 1462.6333 1463.6437 1466.8392 1476.2083 1479.2820 1484.2066 1484.5966 1603.6401 1628.8039 1641.7490 2832.3001 2841.7747 2965.7776 2981.2929 2981.6535 2993.9761 2995.6455 2996.4778 3001.8486 3031.4926 3033.0654 3034.4743 3040.0952 3042.4562 3048.9574 3052.8736 3089.4354 3090.6162 3091.4231 3093.3831 3096.5469 3097.3701 3107.3149 3122.9616 3123.2362 3546.1789
redmass: 3.2814 3.0177 3.8168 3.7124 3.2021 1.9364 4.0313 1.5753 4.9381 2.5645 3.5964 6.5139 4.6827 3.4643 4.2152 2.8582 1.5037 1.6299 2.1741 2.0001 3.3858 3.3283 2.7155 3.3161 3.1886 4.7168 4.6148 2.2306 1.9053 3.3561 3.6168 2.7675 2.8764 3.9089 2.9804 2.3235 3.4430 2.9590 2.0198 2.9495 3.8195 3.8145 3.0274 3.6795 1.8437 1.5745 1.4701 2.1163 3.3823 1.8068 2.0500 2.5587 3.4708 2.1795 1.4930 2.8513 2.3927 1.9568 2.6489 3.6660 2.7598 1.6904 2.1645 1.7110 2.1700 2.1523 2.3234 2.8608 3.3595 1.2717 1.7408 1.7111 2.4209 3.9255 2.8803 2.6926 1.2588 1.2080 1.2577 1.1225 1.6265 1.3464 1.5247 1.3067 1.4097 1.3895 1.4331 1.2744 1.2855 1.3788 1.3852 1.2374 1.2333 1.2288 1.1017 1.0918 1.0927 1.0920 1.1057 1.0876 1.0486 1.0693 1.1305 1.0899 1.0901 1.5341 1.1862 1.0533 1.0530 6.6756 9.7501 10.1579 1.0718 1.0701 1.0626 1.0601 1.0624 1.0361 1.0363 1.0360 1.0641 1.0960 1.0594 1.0595 1.0931 1.0979 1.0950 1.0970 1.0972 1.0997 1.0973 1.0989 1.1031 1.1036 1.0999 1.1066 1.1062 1.0783
irintensity: 2.2503 0.5528 1.3082 0.9655 1.8901 1.4012 0.8073 1.2347 9.2103 4.0946 1.2788 1.2798 1.0307 2.3177 0.4807 3.4642 0.4135 1.5893 0.9368 0.3896 3.7910 5.8109 8.3317 5.4398 1.8699 13.7346 3.0448 4.5059 6.5740 4.9501 0.6162 1.7144 0.1226 32.4882 16.2612 1.3550 11.8587 81.4704 1.7744 57.3236 6.6240 4.3058 5.8080 5.9667 5.1666 1.6450 2.7933 8.0844 14.6978 3.7790 6.8295 2.3472 1.9305 21.2488 0.4538 21.4004 26.9577 9.2691 43.0175 107.3455 54.1646 19.2304 11.0635 68.5760 62.8055 1.8030 45.6916 49.9552 277.7429 5.1044 23.7809 11.5933 49.0633 115.9477 88.7636 11.3314 3.7071 2.8819 16.2260 6.1803 20.9499 5.1271 15.5062 6.1596 8.7005 3.0106 0.1962 1.0039 0.9652 0.1597 7.2205 63.3719 17.6322 33.3237 57.3382 14.5507 28.5355 8.9837 29.1004 11.2323 17.0366 34.4230 69.6577 12.9621 12.8641 144.6739 34.7007 20.4714 15.4917 149.4140 175.8552 82.0618 38.8391 176.6340 41.7205 39.8185 25.6155 19.3174 17.6148 9.6588 14.4573 70.3555 32.4805 22.6679 56.3502 1.8104 37.2924 81.5373 37.5948 6.2279 28.3643 13.9263 1.0661 0.3992 12.5633 28.2042 26.2780 73.2638
temp: 298.150 k
press: 1.00000 atm
elementType: 8 8 8 8 8 7 7 6 6 6 6 6 6 6 6 6 6 6 6 6 6 6 1 1 1 1 1 1 1 1 1 1 1 1 1 1 1 1 1 1 1 1 1 1 1 1 1 1
symmnumber: 1
zpe: 1054368.5 jmol-1
zpe.correction: 0.401588 hartree
zpe.thermalcorrener: 0.426901 hartree
zpe.thermalcorrenthalpy: 0.427845 hartree
zpe.thermalcorrgfe: 0.342016 hartree
zpe.sumelectzpe: -1071.080873 hartree
zpe.sumelectthermal: -1071.055560 hartree
zpe.sumelectthermalent: -1071.054615 hartree
zpe.sumelectthermalfe: -1071.140445 hartree
dipole: 1.7612 2.5926 1.3904
dipole: 3.4288
quadrupole: -126.5348 -132.5608 -119.5217
quadrupole: -3.8880 8.2643 5.4185
quadrupole: -0.3290 -6.3550 6.6841 -3.8880 8.2643 5.4185
hfenergy: -1071.4824606 hartree
pointgroup: C01 [X(C15H26N2O5)]
dipole: 0.9359957 -0.9624137 0.1320579 debye
polarizability: 201.6579567|-0.9809631|183.3203538|-2.6893083|-3.122689|188.4321203 unknown
InChI: InChI=1S/C15H26N2O5/c1-4-21-13(19)15(16-12(3)18,14(20)22-5-2)11-17-9-7-6-8-10-17/h16H,4-11H2,1-3H3
charge 0 multiplicity 1
48 atoms
O  -2.510156 0.8342 0.770118
O  0.585087 -2.118572 -0.474044
O  -2.683559 -0.574631 -1.078639
O  -0.148873 -1.461581 1.637721
O  -1.169937 2.022124 -2.174695
N  1.643417 1.082756 0.72408
N  0.034424 0.112012 -1.657168
C  2.442381 1.983496 -0.145492
C  2.119917 1.101195 2.132012
C  3.93357 1.589493 -0.129485
C  3.602273 0.682303 2.213748
C  0.17834 1.256555 0.585469
C  4.481756 1.582929 1.316013
C  -0.42865 0.093118 -0.26338
C  -1.995906 0.083382 -0.2690
C  0.011245 -1.223773 0.422351
C  -0.403441 1.075984 -2.543227
C  -4.004399 0.865326 0.888738
C  1.023107 -3.439521 0.084221
C  0.077475 0.923837 -3.98043
C  -4.507649 -0.34418 1.680156
C  -0.148886 -4.422454 0.117616
H  2.042251 1.924705 -1.172432
H  2.343327 3.050152 0.188318
H  2.005357 2.12103 2.585304
H  1.494779 0.402502 2.716056
H  -0.306977 1.232719 1.574123
H  -0.099052 2.209733 0.096417
H  4.039801 0.578488 -0.569612
H  4.50683 2.294603 -0.762152
H  3.939344 0.730603 3.267274
H  3.691635 -0.370523 1.880639
H  5.53353 1.2392 1.331855
H  4.473674 2.618704 1.715293
H  0.575982 -0.695866 -1.970245
H  -4.196606 1.816098 1.410355
H  -4.42985 0.894748 -0.129262
H  1.819987 -3.758404 -0.606167
H  1.437092 -3.263343 1.092239
H  0.878798 0.173783 -4.095503
H  0.437982 1.899133 -4.347441
H  -0.777718 0.628018 -4.613791
H  -5.59862 -0.255052 1.838263
H  -4.017232 -0.400665 2.666988
H  -4.314239 -1.28024 1.130476
H  -0.596161 -4.539342 -0.8841
H  -0.92758 -4.078459 0.818091
H  0.208328 -5.412429 0.457033
