program: Gaussian 09
title: 000246298
version: EM64L-G09RevD.01
frameworkgroup: C1[X(C18H18N12S)]
method: RPBEPBE
basis: SDD
operation: Freq
keyword: #p
keyword: freq=noraman
keyword: PBEPBE/SDD
title: #p freq=noraman PBEPBE/SDD
converged: YES YES NO NO
title: Mulliken charges:
elementType: S N N N N N N N N N N N N C C C C C C C C C C C C C C C C C C H H H H H H H H H H H H H H H H H H
charge: 0.230444 -0.420440 -0.420418 -0.167465 -0.167505 -0.159880 -0.159845 -0.139958 -0.140012 -0.590285 -0.590310 -0.588636 -0.588662 -0.238049 -0.237467 0.446375 0.446456 -0.249986 -0.250150 -0.163230 -0.162444 -0.448516 -0.448636 -0.325304 -0.325608 0.099672 0.099605 0.051820 0.051816 0.084125 0.084081 0.250536 0.250318 0.255934 0.255919 0.224796 0.224758 0.308562 0.308482 0.327008 0.326976 0.331214 0.332434 0.332406 0.331186 0.333026 0.330945 0.330921 0.332994
chargesum: 0.00000
title: Mulliken charges with hydrogens summed into heavy atoms:
elementType: S N N N N N N N N N N N N C C C C C C C C C C C C C C C C C C
charge: 0.230444 -0.093432 -0.093442 -0.167465 -0.167505 -0.159880 -0.159845 -0.139958 -0.140012 0.073363 0.073282 0.075335 0.075253 -0.238049 -0.237467 0.446375 0.446456 0.000550 0.000167 0.092704 0.093475 -0.223720 -0.223878 -0.016742 -0.017127 0.099672 0.099605 0.051820 0.051816 0.084125 0.084081
polarizability: 4.89269820e+02 -3.27867592e-01 3.50683500e+02 -6.44799835e+01 1.18294696e-01 2.37349667e+02
1716.lowfreq: -5.0291 0.0011 0.0014 0.0015 1.6011 3.8393 9.9234 11.6590 16.4444
frequency: 9.8409 11.6568 16.3750 35.5097 39.4602 43.2946 58.0049 74.5018 80.7701 114.8914 129.2220 178.3691 184.3309 185.0974 190.0923 190.8629 194.3556 211.0643 217.7367 243.4677 244.5244 304.7952 308.2414 323.5721 324.4754 330.9640 368.6472 407.6657 411.5886 432.1471 437.3720 464.6425 465.2004 475.3163 477.3050 478.5960 481.7784 509.8199 529.7912 539.9454 540.0686 541.6582 542.1061 556.6985 556.7643 588.5127 589.0402 626.2831 626.3108 656.7647 656.8998 663.3386 665.5590 707.1040 707.7346 715.4980 720.5185 720.8835 720.9139 729.4133 730.0255 794.5256 794.6192 821.3824 823.4923 825.9580 826.4897 852.7199 856.7098 900.6671 900.7216 935.9924 936.0524 943.0695 943.3712 992.5836 993.2756 995.2116 999.0954 1016.5014 1016.5926 1065.4278 1081.0973 1105.8346 1107.1859 1124.0726 1124.3949 1131.3605 1132.0082 1187.2433 1189.1428 1242.2210 1242.6602 1282.6453 1282.7307 1294.4879 1298.1441 1332.4810 1337.2488 1383.6357 1388.6091 1408.0694 1411.3795 1442.5418 1442.7888 1476.3727 1481.8084 1489.6820 1491.7191 1501.8082 1509.4226 1531.1181 1532.0322 1543.9505 1547.9890 1584.1395 1587.8365 1596.5930 1596.6433 1609.1237 1610.7812 1634.6850 1634.7616 3116.3597 3116.6021 3146.2758 3146.9032 3153.9244 3154.2028 3189.2711 3189.4107 3524.7391 3524.8214 3557.7482 3557.7884 3559.5017 3559.5976 3718.3328 3718.3833 3719.3576 3719.3968
redmass: 5.1971 7.8394 5.1649 6.4239 5.7013 4.1171 4.2640 7.0685 6.4083 7.6689 6.8315 7.5484 6.6250 6.4810 7.6402 7.8361 6.9022 6.1101 6.2189 5.7821 7.0802 4.4737 3.0414 3.1884 4.7329 5.6320 5.1435 3.0387 3.0156 5.3017 5.0744 1.1947 1.1952 1.2281 2.9952 1.3041 4.0835 2.6850 2.7217 1.0549 1.0547 1.0443 1.0613 8.1688 8.1488 7.4498 7.4201 7.0318 7.0627 1.6176 1.6210 6.1233 6.6115 8.2242 9.6926 3.8522 4.0120 3.0583 2.9718 6.0568 5.9461 10.4600 10.4595 1.6858 1.5154 3.4211 4.5738 1.3903 1.3857 13.2460 13.2389 2.1570 2.1611 1.3581 1.3579 1.4586 1.3221 3.2602 3.8493 3.3518 3.3417 2.8310 2.9824 1.7956 1.8209 2.2096 2.2043 2.2286 2.1324 1.1143 1.1160 2.5776 2.5739 4.5497 4.5614 1.3709 1.3783 3.6923 3.3855 4.0044 4.6133 4.0923 3.9885 4.2021 4.1972 2.4024 2.2920 2.5703 2.6565 7.1602 6.7649 2.7083 2.9339 2.8365 2.7619 3.2308 3.4212 1.4714 1.4705 5.7551 5.8592 2.4824 2.4899 1.0891 1.0890 1.0908 1.0906 1.0952 1.0952 1.0946 1.0946 1.0749 1.0749 1.0440 1.0440 1.0444 1.0444 1.1058 1.1058 1.1058 1.1058
irintensity: 0.9506 0.1088 0.0620 1.0248 0.0121 0.6063 0.9832 0.7191 0.2611 0.5262 0.0023 0.5559 6.8736 3.2760 1.1303 0.2329 6.5664 5.7288 25.7264 4.7693 0.6395 4.0433 7.2899 4.1878 0.0080 1.5284 5.5700 2.0066 0.0437 2.4049 11.8941 7.6201 16.7144 705.9330 6.5803 349.5884 12.7844 84.2012 31.2061 9.4443 7.4097 10.1435 3.1377 6.4322 0.8004 4.3380 3.4491 2.3388 1.0275 45.7086 46.3030 0.3713 2.4013 0.7164 0.1277 2.2171 0.0782 17.5041 10.4733 4.6158 0.8989 59.7098 30.6932 49.0422 34.9401 42.2139 0.0624 56.6062 28.1585 2.1598 0.2290 5.0931 7.8538 1.6551 0.9153 9.7465 1.6669 29.8198 2.1741 4.0186 0.9163 14.5970 0.2597 11.3595 1.7281 4.2583 0.0721 13.9504 2.3598 33.7796 2.0406 81.8136 15.9711 0.3155 1.1635 0.6499 0.5220 10.4835 0.0477 127.4670 90.5183 107.2454 70.8647 105.5483 5.1954 848.4275 72.9440 225.2653 69.9174 1534.0349 2021.4710 316.0350 156.7080 665.7012 252.1066 228.3748 205.1810 261.7655 1085.9600 55.3272 42.7864 77.0053 47.0375 35.6906 10.5454 9.2631 1.4498 8.5245 7.6051 15.8241 13.6234 40.8940 30.1327 46.4051 210.3270 100.4023 94.9450 44.6047 37.3535 51.9418 53.4199
temp: 298.150 k
press: 1.00000 atm
elementType: 16 7 7 7 7 7 7 7 7 7 7 7 7 6 6 6 6 6 6 6 6 6 6 6 6 6 6 6 6 6 6 1 1 1 1 1 1 1 1 1 1 1 1 1 1 1 1 1 1
symmnumber: 1
zpe: 967939.9 jmol-1
zpe.correction: 0.368669 hartree
zpe.thermalcorrener: 0.396169 hartree
zpe.thermalcorrenthalpy: 0.397113 hartree
zpe.thermalcorrgfe: 0.306823 hartree
zpe.sumelectzpe: -1749.717632 hartree
zpe.sumelectthermal: -1749.690132 hartree
zpe.sumelectthermalent: -1749.689187 hartree
zpe.sumelectthermalfe: -1749.779478 hartree
dipole: 0.0170 -4.3655 0.0004
dipole: 4.3655
quadrupole: -138.3526 -177.7631 -165.2759
quadrupole: -0.1190 -17.1186 0.0323
quadrupole: 22.1113 -17.2992 -4.8121 -0.1190 -17.1186 0.0323
hfenergy: -1750.0863006 hartree
pointgroup: C01 [X(C18H18N12S1)]
dipole: -0.0062956 -1.7175148 0.0018085 debye
polarizability: 492.3121064|0.2905922|350.6831695|-58.1549892|-0.2687157|234.3077113 unknown
InChI: InChI=1S/C18H18N12S/c19-13-25-14(20)28-17(27-13)23-9-1-5-11(6-2-9)31-12-7-3-10(4-8-12)24-18-29-15(21)26-16(22)30-18/h1-8,23-24H,19-22H2
charge 0 multiplicity 1
49 atoms
S  -0.000535 4.141923 -0.005859
N  -4.857111 0.530418 0.750428
N  4.861708 0.534335 -0.745754
N  -6.519427 -1.067103 0.670682
N  6.524017 -1.062993 -0.66271
N  -4.691265 -1.154083 -0.945151
N  4.686947 -1.156429 0.942661
N  -6.468692 -2.837662 -1.012067
N  6.464697 -2.839529 1.01345
N  -8.192705 -2.701293 0.565508
N  8.197215 -2.697058 -0.55423
N  -4.694179 -2.870079 -2.535217
N  4.681867 -2.877927 2.526744
C  -1.418703 2.982059 0.211073
C  1.419193 2.982802 -0.217627
C  -3.699603 1.312759 0.521926
C  3.70255 1.315421 -0.52109
C  -2.364047 3.255372 1.227474
C  2.371019 3.260783 -1.226736
C  -1.622751 1.877469 -0.648124
C  1.617944 1.87448 0.63791
C  -3.497909 2.433235 1.375681
C  3.505985 2.439561 -1.371208
C  -2.743543 1.03797 -0.495117
C  2.740025 1.035993 0.488495
C  -5.346767 -0.599799 0.117841
C  5.348118 -0.598054 -0.114675
C  -7.026126 -2.184268 0.062245
C  7.027734 -2.182144 -0.05551
C  -5.306978 -2.272096 -1.464435
C  5.300296 -2.275981 1.461412
H  -2.21024 4.101972 1.904538
H  2.221495 4.110247 -1.901189
H  -0.896398 1.665008 -1.439709
H  0.886527 1.658151 1.423756
H  -4.224625 2.656663 2.167164
H  4.237701 2.666629 -2.157039
H  -2.906218 0.180225 -1.149039
H  2.898622 0.1755 1.13981
H  -5.465975 0.822992 1.519713
H  5.474934 0.830099 -1.510339
H  -8.636443 -2.24584 1.358237
H  -8.592476 -3.529238 0.132302
H  8.594857 -3.526413 -0.121766
H  8.645067 -2.238731 -1.342976
H  -5.11777 -3.696614 -2.948133
H  -3.831146 -2.475058 -2.898594
H  3.816706 -2.484455 2.886719
H  5.103512 -3.705721 2.939123
