program: Gaussian 09
title: 000246290
version: EM64L-G09RevD.01
frameworkgroup: C1[X(C9H10O3)]
method: RPBEPBE
basis: SDD
operation: Freq
keyword: #pfreq=noraman
keyword: PBEPBE/SDD
title: #p freq=noraman PBEPBE/SDD
converged: NO YES NO NO
title: Mulliken charges:
elementType: O O O C C C C C C C C C H H H H H H H H H H
charge: -0.200327 -0.156891 -0.156891 -0.181233 -0.181232 -0.246740 -0.246742 -0.523752 -0.467951 -0.467948 0.148079 0.148078 0.277330 0.277329 0.282817 0.282816 0.239020 0.259718 0.242474 0.214786 0.214785 0.242475
chargesum: 0.00000
title: Mulliken charges with hydrogens summed into heavy atoms:
elementType: O O O C C C C C C C C C
charge: -0.200327 -0.156891 -0.156891 0.096097 0.096097 0.036077 0.036074 -0.025014 -0.010691 -0.010688 0.148079 0.148078
polarizability: 1.01319437e+02 1.23202573e-04 1.06254800e+02 -2.32069779e+00 4.88723427e-05 7.35250810e+01
1716.lowfreq: -24.9096 -20.3598 0.0005 0.0006 0.0008 22.2918 67.8331 128.1163 169.6384
frequency: 67.0999 128.1163 169.6102 178.6298 260.9721 309.2173 402.1861 456.8799 465.9748 548.1808 573.2785 618.9977 623.8920 721.0207 768.4738 782.9136 790.6755 819.5283 819.5830 864.8627 883.3168 915.8616 924.5678 932.9872 959.4464 964.9300 1014.7549 1035.6088 1053.3738 1066.5933 1101.2031 1108.1618 1138.4841 1142.3274 1186.4380 1193.9327 1206.6705 1243.7063 1247.0694 1265.1737 1272.2443 1290.6575 1297.1582 1303.4948 1314.4428 1469.0684 1478.8334 1499.5907 1699.3006 1767.7361 3004.8776 3017.4931 3021.6444 3046.3371 3058.8385 3059.1511 3081.3866 3087.1383 3089.8621 3096.4294
redmass: 4.1121 15.2560 5.0743 4.5675 1.8944 5.3237 4.9268 5.7639 2.0760 4.6187 12.1115 7.1875 6.1916 6.0753 2.6472 5.1194 2.8929 9.8414 2.3278 2.2708 2.4705 2.5303 3.5116 2.3186 2.1295 1.7285 1.5413 1.5350 1.7907 2.4591 1.9482 1.1674 2.1624 1.9892 1.6359 1.7423 1.1904 1.5771 1.3618 1.3727 1.3666 1.6505 1.4516 1.6085 1.5215 1.0790 1.0877 1.0975 12.9896 12.8095 1.0589 1.0616 1.0621 1.0854 1.1045 1.0871 1.1045 1.0882 1.1046 1.0936
irintensity: 0.1498 2.8357 5.3670 1.5859 1.9443 4.1227 5.6864 0.7738 0.9968 22.5784 2.6156 2.1946 5.4925 16.9256 0.0643 36.9541 0.1892 265.8014 10.5672 8.4447 7.0186 6.3593 1.4413 27.2036 2.0019 0.5206 7.2173 10.1333 1.0100 80.2347 64.7910 1.1507 112.6828 0.0234 15.4840 11.8452 0.0207 0.4017 0.8531 1.3021 0.3494 0.0717 4.3937 0.1150 4.2394 4.2379 16.7584 8.5733 477.4240 115.3319 29.1662 62.4611 9.4537 3.8809 0.7350 6.5604 34.4480 32.6447 34.2913 12.1520
temp: 298.150 k
press: 1.00000 atm
elementType: 8 8 8 6 6 6 6 6 6 6 6 6 1 1 1 1 1 1 1 1 1 1
symmnumber: 1
zpe: 460026.3 jmol-1
zpe.correction: 0.175215 hartree
zpe.thermalcorrener: 0.184333 hartree
zpe.thermalcorrenthalpy: 0.185278 hartree
zpe.thermalcorrgfe: 0.140617 hartree
zpe.sumelectzpe: -573.747333 hartree
zpe.sumelectthermal: -573.738214 hartree
zpe.sumelectthermalent: -573.737270 hartree
zpe.sumelectthermalfe: -573.781930 hartree
dipole: 5.9752 0.0000 -1.3294
dipole: 6.1213
quadrupole: -79.0339 -81.3562 -65.0285
quadrupole: 0.0000 2.7604 -0.0001
quadrupole: -3.8943 -6.2167 10.1110 0.0000 2.7604 -0.0001
hfenergy: -573.9225474 hartree
pointgroup: C01 [X(C9H10O3)]
dipole: -2.3437038 0.0001347 -0.554098 debye
dipolederiv: -0.5931087 -0.000117 -0.0799008 -0.0001362 -1.7946296 0.0002239 -0.1898888 0.0002268 -0.2097784 -0.5848433 0.2629434 -0.0361181 0.2432128 -1.0760478 0.0052473 -0.1129413 0.0942049 -0.3154501 -0.584937 -0.2630483 -0.0360488 -0.2433333 -1.0759843 -0.0050364 -0.1128878 -0.0939664 -0.3154229 0.2117442 0.0161326 -0.0352975 0.0705747 0.0910282 -0.0205667 -0.1629565 -0.0153177 0.0810879 0.2117321 -0.0161623 -0.0352897 -0.070637 0.0910565 0.0205711 -0.1629338 0.0153434 0.0810796 -0.415546 0.021472 -0.0470992 0.0116821 -0.0452596 0.0325923 -0.0411219 0.0251611 0.0614762 -0.4155559 -0.0214199 -0.0470965 -0.0116295 -0.0452682 -0.0325529 -0.041124 -0.0251239 0.061493 0.0331812 -0.0000083 -0.0170491 -0.0000051 -0.0423032 0.0000004 0.0019328 -0.0000007 -0.0352164 0.0196709 0.0534648 -0.0377867 0.0018419 0.023954 0.0116112 0.0056757 0.0157597 0.1039012 0.0196627 -0.0534738 -0.0377767 -0.0018399 0.023954 -0.0115813 0.0056714 -0.0157389 0.1039069 1.0310032 0.1853605 0.1542126 -0.2017541 1.9000984 0.0240831 0.3442929 0.0931574 0.2746658 1.0310113 -0.1851569 0.1542575 0.2020091 1.9000665 -0.0245536 0.3442183 -0.0936674 0.2746961 0.0436244 0.0289846 -0.0058854 0.0012688 -0.1023684 0.0540323 0.0098663 0.0527865 0.0575367 0.0436184 -0.0290118 -0.0058875 -0.001292 -0.102392 -0.0539892 0.0098569 -0.0527454 0.0575646 0.0765824 -0.0104806 -0.0219985 0.0200645 0.0330917 -0.0548474 -0.0042561 -0.0703682 -0.0431962 0.0765785 0.0104673 -0.0219919 -0.020074 0.0331259 0.0548307 -0.0042391 0.070349 -0.0432297 -0.0549311 0.0000304 0.1477519 0.0000251 0.077693 -0.0000233 0.1100619 -0.0000209 -0.0132084 -0.0811457 -0.0000063 -0.1334979 -0.0000013 0.0546847 0.0000078 -0.0955239 0.0000045 0.0262897 -0.1102665 -0.0796157 0.0664943 -0.050994 0.018244 0.0222181 0.0991265 0.0591081 0.0278316 0.0760846 0.0090104 0.0047611 -0.0118956 0.0095036 -0.0715703 -0.0509743 -0.1074388 -0.1319175 0.0760855 -0.0090222 0.0047799 0.0118686 0.0095531 0.071529 -0.0509555 0.107409 -0.131966 -0.1102451 0.0796573 0.0664672 0.0510445 0.0181994 -0.0222262 0.0991003 -0.0591219 0.0278562 unknown
polarizability: 101.2531303|0.0009216|106.2547994|2.6877882|-0.0047423|73.5913888 unknown
InChI: InChI=1S/C9H10O3/c10-8-6-4-1-2-5(3-4)7(6)9(11)12-8/h4-7H,1-3H2
charge 0 multiplicity 1
22 atoms
O  2.138672 -0.000163 0.194479
O  1.837133 -2.311418 0.070415
O  1.837557 2.311111 0.069777
C  -1.170174 -1.145419 0.328366
C  -1.169978 1.145715 0.328068
C  -0.001856 -0.780487 -0.650857
C  -0.001719 0.78032 -0.65106
C  -1.071733 0.000277 1.378163
C  -2.50103 -0.787671 -0.400938
C  -2.500892 0.788007 -0.401151
C  1.369527 -1.186902 -0.118051
C  1.369738 1.18663 -0.118364
H  -1.112791 -2.177333 0.706171
H  -1.112413 2.177719 0.705599
H  -0.149295 -1.244722 -1.640646
H  -0.149077 1.244321 -1.640972
H  -1.919489 0.000439 2.084021
H  -0.133025 0.000273 1.960337
H  -3.362658 -1.187039 0.16244
H  -2.545585 -1.214773 -1.418588
H  -2.545358 1.214834 -1.418919
H  -3.362455 1.18768 0.162111
