program: Gaussian 09
title: 000246281
version: EM64L-G09RevD.01
frameworkgroup: C1[X(C16H17O5P)]
method: RPBEPBE
basis: SDD
operation: Freq
keyword: #p
keyword: freq=noraman
keyword: PBEPBE/SDD
title: #p freq=noraman PBEPBE/SDD
converged: YES YES NO NO
title: Mulliken charges:
elementType: P O O O O O C C C C C C C C C C C C C C C C H H H H H H H H H H H H H H H H H
charge: 1.427272 -0.527196 -0.499708 -0.512361 -0.220992 -0.615367 -0.312979 0.489410 0.108907 0.346389 -0.442017 -0.343890 -0.219726 -0.227962 -0.366606 -0.360365 -0.235913 -0.224456 -0.243797 -0.220991 -0.483875 -0.497191 0.253479 0.233379 0.271042 0.229304 0.228170 0.263823 0.273086 0.230749 0.233874 0.235690 0.234007 0.251328 0.245837 0.240473 0.280762 0.236291 0.242120
chargesum: 0.00000
title: Mulliken charges with hydrogens summed into heavy atoms:
elementType: P O O O O O C C C C C C C C C C C C C C C C
charge: 1.427272 -0.527196 -0.499708 -0.512361 -0.220992 -0.615367 -0.059501 0.489410 0.108907 0.346389 -0.208639 -0.072848 0.009578 0.000208 -0.102783 -0.087279 -0.005164 0.009417 -0.008107 0.013016 0.253763 0.261982
polarizability: 2.26846968e+02 1.53884554e+01 2.20940988e+02 1.56907517e+01 1.22794251e+01 1.88159349e+02
1716.lowfreq: -5.3474 -0.0009 0.0002 0.0008 2.0966 7.0701 14.3884 25.9194 28.4473
frequency: 13.2374 25.7504 28.4159 36.9895 45.6889 58.8533 64.7384 79.4294 104.9225 122.5136 138.6533 140.1145 162.1153 167.1643 186.6956 192.3575 217.2102 228.8088 250.1203 281.1166 306.2018 350.7944 376.0213 389.9918 396.8152 400.6535 401.7747 438.5520 491.7187 504.7719 553.7406 611.9654 613.2125 619.5126 662.3380 687.6558 696.7809 698.6795 703.7833 719.1877 767.0988 794.3124 829.3239 850.9021 852.7063 856.6737 911.1348 927.5760 942.8130 957.8749 966.2498 978.5286 980.4969 986.5039 990.4357 992.1503 998.7968 1003.8406 1026.3698 1028.8881 1054.1483 1083.4352 1089.3752 1113.4192 1116.6534 1133.0573 1139.8229 1173.4165 1174.9335 1187.2080 1191.1339 1201.6521 1227.4812 1261.1187 1313.9016 1330.2038 1337.9042 1383.7628 1387.0054 1423.3845 1431.5793 1434.4154 1441.4869 1460.3596 1465.0906 1474.0069 1477.5344 1479.7012 1481.4308 1571.6787 1590.9757 1594.3899 1607.7066 1610.8118 2991.7414 2996.9245 3051.9110 3100.5976 3106.3108 3122.4027 3129.9806 3131.0395 3136.2627 3137.3120 3139.9707 3145.0095 3149.4903 3158.8790 3159.9709 3169.6641 3171.2561
redmass: 5.4103 3.7716 5.6581 4.0973 3.9391 3.5093 5.0525 3.9022 6.3420 4.1841 1.9690 1.6256 1.5655 3.5148 4.8803 3.1735 5.4737 5.3225 5.7749 6.5885 7.5954 6.9543 11.2838 6.4109 3.7846 2.9247 3.0931 6.4758 5.0293 4.1641 6.8735 6.5273 6.4894 6.9151 7.3691 4.1020 3.1371 1.7830 3.7599 3.3161 2.1126 2.7278 4.6688 2.1652 1.2724 1.7884 4.5912 1.4979 1.7065 10.4173 9.8713 1.4005 1.7309 4.6476 3.4045 5.0092 1.3746 1.3703 2.1967 2.0403 15.2729 1.6183 1.6131 1.2380 1.2457 1.2790 1.2854 1.0591 1.0594 1.1387 1.2046 1.7448 2.4737 2.2083 1.3210 1.3101 1.2535 8.4151 7.5734 1.1221 1.1222 2.2525 2.1633 1.0503 1.0473 1.0549 2.2020 1.0643 2.2515 7.0711 6.9700 6.0480 6.0428 6.2010 1.0292 1.0286 1.0854 1.1067 1.1057 1.0868 1.0853 1.0879 1.1041 1.1049 1.0881 1.0927 1.0927 1.0967 1.0968 1.1016 1.0995
irintensity: 1.2457 0.7255 0.9820 1.6554 2.2147 1.8621 5.3710 6.7218 1.9955 4.4623 2.7099 2.0593 3.8672 8.0348 3.4040 0.9045 2.7758 0.7048 7.1366 5.2899 4.5610 13.6245 56.9035 10.3851 1.9327 3.1168 2.9733 3.2974 0.6424 27.0634 3.5346 7.7879 1.5781 58.4481 45.0937 13.8613 40.4951 48.2675 150.5170 138.9017 141.1161 41.1251 23.1338 2.3878 0.2744 0.4487 169.8899 11.9245 61.4257 259.6838 57.0133 0.2861 2.3678 27.4031 0.4076 8.6342 1.3998 2.5243 7.1897 2.9391 166.5815 10.4432 5.8035 0.5252 1.4338 1.6667 0.4015 0.2852 0.9376 8.7639 3.4443 10.7815 96.9084 78.3020 11.0503 16.3545 5.6641 3.4468 1.7753 3.2812 2.0729 17.8982 10.8655 8.6768 13.1649 14.4127 4.8721 42.2498 9.8022 89.1324 57.3505 4.9575 13.6918 1.9915 37.7829 39.0937 6.8966 15.2148 22.7983 4.1306 0.2694 1.7951 13.2961 12.2122 6.6772 26.6866 8.0330 13.8245 25.4948 27.2555 10.7055
temp: 298.150 k
press: 1.00000 atm
elementType: 15 8 8 8 8 8 6 6 6 6 6 6 6 6 6 6 6 6 6 6 6 6 1 1 1 1 1 1 1 1 1 1 1 1 1 1 1 1 1
symmnumber: 1
zpe: 779095.7 jmol-1
zpe.correction: 0.296742 hartree
zpe.thermalcorrener: 0.319294 hartree
zpe.thermalcorrenthalpy: 0.320238 hartree
zpe.thermalcorrgfe: 0.241264 hartree
zpe.sumelectzpe: -1335.605855 hartree
zpe.sumelectthermal: -1335.583303 hartree
zpe.sumelectthermalent: -1335.582359 hartree
zpe.sumelectthermalfe: -1335.661333 hartree
dipole: -1.5632 2.5663 0.3902
dipole: 3.0302
quadrupole: -116.5865 -131.4203 -131.1666
quadrupole: 8.8965 7.7342 -4.7558
quadrupole: 9.8046 -5.0291 -4.7755 8.8965 7.7342 -4.7558
hfenergy: -1335.9025968 hartree
pointgroup: C01 [X(C16H17O5P1)]
dipole: -0.7108627 0.9565024 -0.0317681 debye
polarizability: 238.5871729|15.3666267|215.8728284|-2.2161063|0.8177826|181.487304 unknown
InChI: InChI=1S/C16H17O5P/c1-19-22(18,20-2)21-16(14-11-7-4-8-12-14)15(17)13-9-5-3-6-10-13/h3-12,16H,1-2H3
charge 0 multiplicity 1
39 atoms
P  0.416833 -2.787854 0.80696
O  -0.805204 -1.558113 0.570999
O  -0.082045 -3.645349 2.193692
O  0.0220 -3.927986 -0.414434
O  -0.167869 -0.208379 -1.852933
O  1.887664 -2.200881 0.907115
C  -0.334877 -0.144931 0.586906
C  -1.560134 0.729428 0.798804
C  0.338453 0.208175 -0.771092
C  1.525259 1.113311 -0.751912
C  -1.567012 1.712291 1.817665
C  -2.697331 0.569107 -0.033067
C  -2.702372 2.532651 2.006027
C  -3.833119 1.382144 0.164187
C  1.694773 2.0317 -1.82422
C  2.50862 1.037559 0.272888
C  -3.838488 2.367193 1.18127
C  2.811019 2.889964 -1.852421
C  3.635066 1.886211 0.227777
C  3.782614 2.82066 -0.823719
C  -1.460759 -4.198064 2.26455
C  0.203722 -3.540974 -1.841149
H  0.380875 -0.002979 1.414127
H  -0.689901 1.83502 2.464673
H  -2.678945 -0.19047 -0.820691
H  -2.702299 3.291903 2.795755
H  -4.713207 1.252479 -0.475448
H  0.939783 2.058705 -2.617165
H  2.435517 0.270478 1.051031
H  -4.720973 2.999734 1.329151
H  2.92959 3.60787 -2.671178
H  4.403717 1.809442 1.004176
H  4.654798 3.483612 -0.849103
H  -1.604959 -4.962352 1.483025
H  -2.204852 -3.389296 2.159315
H  -1.518912 -4.648675 3.265996
H  -0.321028 -2.594633 -2.058952
H  -0.237223 -4.374472 -2.406889
H  1.278904 -3.447029 -2.071615
