program: Gaussian 09
title: 000246255
version: EM64L-G09RevD.01
frameworkgroup: C1[X(C19H26N2O)]
method: RPBEPBE
basis: SDD
operation: Freq
keyword: #p
keyword: freq=noraman
keyword: PBEPBE/SDD
title: #p freq=noraman PBEPBE/SDD
converged: YES YES NO NO
title: Mulliken charges:
elementType: O N N C C C C C C C C C C C C C C C C C C C H H H H H H H H H H H H H H H H H H H H H H H H H H
charge: -0.318094 -0.012627 -0.006973 -0.111343 -0.451085 -0.430081 -0.368075 -0.363454 0.081315 -0.357718 -0.351377 0.001696 -0.704668 -0.700808 -0.308226 -0.263363 0.434074 -0.337257 -0.394366 -0.211472 -0.201849 -0.245532 0.239974 0.193834 0.227411 0.221175 0.192653 0.198321 0.191551 0.201721 0.187259 0.194893 0.217958 0.198707 0.192786 0.212119 0.210852 0.211016 0.209954 0.214876 0.210254 0.241415 0.242458 0.262038 0.260302 0.228013 0.229755 0.229985
chargesum: 0.00000
title: Mulliken charges with hydrogens summed into heavy atoms:
elementType: O N N C C C C C C C C C C C C C C C C C C C
charge: -0.318094 -0.012627 -0.006973 0.128631 -0.029840 -0.016253 0.021797 0.025526 0.081315 0.055133 0.040116 0.001696 -0.070681 -0.065723 -0.066811 -0.020905 0.434074 -0.075219 -0.134064 0.016541 0.027906 -0.015547
polarizability: 2.58694918e+02 -1.60279462e+01 2.10949856e+02 -2.80298612e+01 -1.77394384e+01 1.96264832e+02
1716.lowfreq: -9.5147 -4.6367 -0.0004 0.0005 0.0006 6.0735 16.7694 21.3182 34.4335
frequency: 16.6222 21.1747 34.4076 38.6213 44.3348 49.2096 60.0151 77.6886 96.5082 98.3611 112.3409 135.5855 148.6236 161.4469 212.3935 231.4179 234.8533 238.1415 256.6646 268.7494 281.3975 311.1910 345.1007 390.8573 408.6105 425.9845 440.0261 483.3460 502.0189 531.0908 567.2886 579.1087 590.6942 608.4029 633.0051 686.9907 703.4962 726.6496 736.9416 765.6559 778.5139 785.4139 801.9509 829.6790 832.5456 841.1370 852.1782 877.8407 890.4912 906.4820 913.2517 938.2146 949.2172 963.9202 965.8545 986.2588 989.0980 991.8178 1020.1359 1036.0610 1044.0248 1049.3558 1064.4560 1071.5966 1078.0666 1086.0082 1091.2154 1109.1153 1117.2588 1140.8877 1160.8807 1170.0208 1185.4318 1199.5237 1209.4688 1230.2853 1235.7121 1249.3254 1258.9664 1264.9441 1285.0256 1286.4293 1291.5750 1297.1083 1309.0440 1310.8177 1332.4497 1335.5013 1339.7961 1355.3244 1358.1298 1383.4702 1386.4687 1387.9095 1389.0462 1415.7014 1441.0202 1454.2823 1464.5747 1465.2359 1466.7363 1470.8282 1475.7098 1475.8757 1477.1474 1477.4065 1486.6104 1488.3190 1504.3608 1516.1402 1598.0520 1606.0011 2954.3147 2960.8042 2964.7272 2966.6836 2968.3331 2971.2212 2973.1661 2973.8354 2994.9505 3005.8368 3017.9778 3022.2167 3033.3095 3035.1096 3050.9351 3063.8217 3067.0497 3067.9209 3069.7208 3131.8877 3138.4412 3143.1319 3159.7225 3165.7760 3172.2935 3187.7895
redmass: 4.4714 3.8047 3.3360 4.1611 5.3516 4.0187 1.6364 3.1041 3.4801 2.0823 2.5397 3.3742 3.7030 2.9329 2.0054 1.9196 1.5463 1.5182 2.9541 2.1247 3.4117 4.3020 5.7184 3.6629 2.8655 3.3801 3.7647 3.3769 5.5912 3.3615 5.9045 5.0028 3.3161 6.2005 4.4813 2.4883 2.6200 1.1001 1.1979 1.7990 1.6282 4.2016 2.8873 1.2636 1.9057 1.7481 1.2720 4.9703 1.8204 1.4442 1.3124 1.4527 1.4424 1.3913 1.9629 1.6003 3.3454 3.7462 2.1825 3.5070 2.2411 2.4305 2.1933 2.1651 1.5193 1.8677 2.0007 2.2885 1.9324 2.4518 1.9095 1.0865 1.5175 1.4857 1.5581 1.4974 2.4561 2.6866 1.3069 1.8290 1.2229 1.3265 1.1943 1.2960 1.3524 1.2218 1.3711 1.3700 1.8798 1.6369 1.5158 3.5242 1.2576 2.1666 1.3843 1.9558 2.2538 1.0807 1.0814 1.1072 1.1217 1.9594 1.0700 1.0715 1.0622 1.0488 1.0815 1.0777 7.8212 5.3149 6.3434 6.7031 1.0587 1.0581 1.0594 1.0480 1.0501 1.0363 1.0619 1.0612 1.0972 1.0961 1.0966 1.0966 1.0997 1.1014 1.0972 1.1004 1.0998 1.1007 1.0992 1.0852 1.0878 1.0901 1.0946 1.0993 1.0983 1.0965
irintensity: 0.1087 0.0790 0.0041 0.5300 0.2459 0.1385 0.1045 0.3092 1.2664 0.2545 0.0761 0.2575 0.3646 0.0715 0.1325 0.1169 0.1058 0.0197 0.4122 0.6897 2.1285 1.9070 1.4180 1.9359 0.1095 3.2226 2.3280 10.2596 6.2011 1.7698 0.1120 3.7744 1.1397 1.2955 3.2840 22.5901 20.2635 5.1647 20.0996 63.4134 3.7918 9.1185 1.0196 1.8531 4.5624 5.2987 26.9564 29.0246 5.7820 3.3399 1.0357 0.1166 12.5569 0.0778 8.1125 0.5282 2.0219 2.0258 14.3599 1.4342 1.7923 8.7656 7.2109 2.6893 9.4746 9.8203 1.5854 7.7548 5.3409 7.2195 129.4248 8.8065 69.4615 4.5394 2.7166 38.5331 109.7526 98.5212 3.0463 1.0040 1.3130 7.6757 9.3997 2.7162 5.4966 3.6035 5.9731 3.6966 172.1703 12.8875 3.7002 21.3773 10.3324 78.6797 43.5352 5.7529 5.7640 0.4298 2.4527 8.9986 3.8404 105.5530 6.0900 1.5749 23.6805 10.6382 14.8488 15.1085 48.6519 1.4746 25.5909 18.2516 5.4930 10.7486 28.3238 25.9465 19.7243 39.6213 46.3741 104.3431 4.3494 18.3460 3.9219 18.1832 40.8643 1.7728 55.2696 95.7426 65.2273 93.9778 60.2857 0.2875 0.8422 13.8727 33.9558 47.6292 12.0386 1.7839
temp: 298.150 k
press: 1.00000 atm
elementType: 8 7 7 6 6 6 6 6 6 6 6 6 6 6 6 6 6 6 6 6 6 6 1 1 1 1 1 1 1 1 1 1 1 1 1 1 1 1 1 1 1 1 1 1 1 1 1 1
symmnumber: 1
zpe: 1070745.7 jmol-1
zpe.correction: 0.407825 hartree
zpe.thermalcorrener: 0.430738 hartree
zpe.thermalcorrenthalpy: 0.431683 hartree
zpe.thermalcorrgfe: 0.352061 hartree
zpe.sumelectzpe: -922.674171 hartree
zpe.sumelectthermal: -922.651258 hartree
zpe.sumelectthermalent: -922.650314 hartree
zpe.sumelectthermalfe: -922.729936 hartree
dipole: 0.6387 -0.5089 0.0543
dipole: 0.8184
quadrupole: -129.7363 -127.8435 -129.2195
quadrupole: -1.4871 -3.3906 -4.7435
quadrupole: -0.8032 1.0896 -0.2864 -1.4871 -3.3906 -4.7435
hfenergy: -923.0819962 hartree
pointgroup: C01 [X(C19H26N2O1)]
dipole: 0.2829368 0.1481154 -0.0411103 debye
polarizability: 262.5057023|10.2528458|200.3690697|23.6045699|-22.9407233|203.034834 unknown
InChI: InChI=1S/C19H26N2O/c1-3-5-10-16(11-6-4-2)18-19(21-15-14-20-18)22-17-12-8-7-9-13-17/h7-9,12-16H,3-6,10-11H2,1-2H3
charge 0 multiplicity 1
48 atoms
O  0.895906 -0.02509 0.186269
N  -1.991212 -0.223323 -2.040352
N  0.752104 0.467771 -2.139597
C  -1.91386 -0.69832 0.38617
C  -2.248894 -2.222802 0.320219
C  -3.203068 0.130897 0.6449
C  -1.022467 -3.165882 0.269071
C  -2.946137 1.635422 0.884022
C  -1.238072 -0.262553 -0.905034
C  -0.192639 -3.197884 1.574366
C  -4.238851 2.419142 1.206449
C  0.152547 0.086303 -0.991897
C  1.01343 -4.158552 1.487008
C  -3.988863 3.924418 1.44185
C  -1.393067 0.154606 -3.211954
C  -0.028499 0.503695 -3.261368
C  2.260043 0.39441 0.286067
C  2.707039 1.654846 -0.164051
C  3.111961 -0.486708 0.98266
C  4.046616 2.025817 0.086857
C  4.448351 -0.100053 1.228416
C  4.920253 1.155337 0.78041
H  -1.20796 -0.51892 1.217198
H  -2.862651 -2.477219 1.208649
H  -2.886501 -2.387167 -0.57093
H  -3.885297 0.002234 -0.217913
H  -3.713143 -0.29554 1.532832
H  -0.361832 -2.880744 -0.575691
H  -1.375488 -4.194289 0.04802
H  -2.469319 2.08012 -0.013584
H  -2.224342 1.7624 1.718237
H  -0.850971 -3.501931 2.414037
H  0.168684 -2.178055 1.808149
H  -4.959516 2.287394 0.373756
H  -4.717725 1.97752 2.104525
H  1.59188 -4.173454 2.429659
H  0.683815 -5.194084 1.278181
H  1.698322 -3.858146 0.670671
H  -3.53934 4.395663 0.547323
H  -4.928057 4.461299 1.670366
H  -3.29393 4.083321 2.288211
H  -2.023567 0.175265 -4.105853
H  0.459703 0.812226 -4.191239
H  2.03371 2.321548 -0.706795
H  2.723379 -1.451871 1.321786
H  4.406109 3.000522 -0.260785
H  5.116413 -0.77958 1.76853
H  5.956904 1.453489 0.969979
