program: Gaussian 09
title: 000246239
version: EM64L-G09RevD.01
frameworkgroup: C1[X(C10H20Cl6N6P4)]
method: RPBEPBE
basis: SDD
operation: Freq
keyword: #p
keyword: freq=noraman
keyword: PBEPBE/SDD
title: #p freq=noraman PBEPBE/SDD
converged: YES YES NO NO
title: Mulliken charges:
elementType: Cl Cl Cl Cl Cl Cl P P P P N N N N N N C C C C C C C C C C H H H H H H H H H H H H H H H H H H H H
charge: -0.146321 -0.146322 -0.136207 -0.094821 -0.136206 -0.094821 1.045609 1.045613 0.762913 0.762913 -0.469322 -0.469324 -0.694526 -0.694528 -0.751807 -0.751808 -0.322272 -0.339641 -0.322271 -0.339639 -0.372448 -0.364752 -0.372447 -0.364753 -0.403400 -0.403400 0.228639 0.266748 0.271902 0.228203 0.228638 0.266748 0.271902 0.228204 0.210149 0.223108 0.222306 0.211782 0.210149 0.223107 0.222307 0.211782 0.228564 0.195591 0.228564 0.195591
chargesum: 0.00000
title: Mulliken charges with hydrogens summed into heavy atoms:
elementType: Cl Cl Cl Cl Cl Cl P P P P N N N N N N C C C C C C C C C C
charge: -0.146321 -0.146322 -0.136207 -0.094821 -0.136206 -0.094821 1.045609 1.045613 0.762913 0.762913 -0.469322 -0.469324 -0.694526 -0.694528 -0.751807 -0.751808 0.173115 0.160464 0.173115 0.160466 0.060809 0.069336 0.060809 0.069336 0.020756 0.020756
polarizability: 3.88357654e+02 -1.34916752e+01 3.50643758e+02 5.48362825e-03 -1.70315342e-03 3.20698497e+02
1716.lowfreq: -7.1172 -2.3610 -0.0026 -0.0023 0.0013 2.8592 6.3808 16.8602 20.5724
frequency: 6.2462 16.7315 20.5689 29.2595 32.4267 43.8547 45.8290 48.1692 50.2099 63.2958 74.2660 88.5585 93.8996 100.5940 107.2121 117.0801 127.6007 144.6319 150.3422 151.4944 157.9716 158.5685 182.8017 204.6154 208.8663 236.3817 237.8589 240.0865 241.2575 247.1030 264.9641 276.9126 282.0577 286.4425 332.7660 354.8264 357.2735 363.7161 383.0674 386.6115 397.6913 401.9058 412.8264 423.1034 433.6732 438.2489 438.8145 446.8902 510.5924 514.2571 579.2699 580.4415 625.4808 658.1062 685.0313 688.2457 804.9005 804.9993 832.4964 832.5479 848.8768 849.0850 903.6857 904.2909 947.2792 950.8658 952.0604 952.1147 983.5581 1019.1385 1021.9007 1042.0909 1048.8067 1052.7303 1071.4354 1076.6105 1076.7034 1094.9187 1111.7236 1111.9115 1154.7185 1154.8296 1157.5018 1157.5823 1211.7770 1211.8358 1256.4550 1256.5287 1273.8309 1273.8789 1315.7660 1315.8845 1332.9681 1333.0347 1340.9015 1340.9298 1347.6937 1347.7800 1353.2655 1353.4311 1368.0575 1368.0971 1455.1822 1455.2090 1464.7669 1464.8001 1466.4643 1466.4920 1469.0169 1469.0560 1479.9153 1479.9859 2958.6707 2958.6823 2960.5401 2960.7339 2974.7960 2974.8539 2997.0625 2997.0911 2997.9795 2997.9845 3044.3798 3044.4754 3058.8564 3058.8614 3065.9576 3066.0480 3082.9808 3083.0052 3084.9190 3084.9384
redmass: 7.3100 7.2556 8.1494 4.3703 4.3151 5.7366 7.2836 8.2630 6.2099 17.9335 6.7184 30.0642 12.4162 17.2828 11.4437 7.2132 12.8420 10.1760 6.9533 11.3875 7.1227 8.9394 8.7294 2.9185 13.8833 3.8603 3.0516 10.7056 3.9528 8.8541 8.6124 5.6196 7.2014 4.6292 4.1827 4.2506 4.1484 3.5597 3.6014 2.2638 4.8257 10.4013 18.1603 8.8641 15.5005 3.0149 3.2221 10.2344 2.3702 2.4622 4.6227 4.3238 21.5603 20.4163 4.4564 4.5134 1.4575 1.4562 2.7256 2.7384 1.4818 1.4764 2.4672 2.4549 3.1474 3.0974 1.3227 1.3199 14.2110 2.4596 2.2485 6.0303 2.2070 2.4770 6.7052 1.8818 1.6386 12.8490 3.2591 3.2852 1.7208 1.7256 1.4469 1.4582 1.8360 1.8319 1.2622 1.2621 1.1602 1.1602 1.4435 1.4421 1.2727 1.2726 1.3280 1.3284 1.3455 1.3441 1.4252 1.4249 1.3292 1.3292 1.0864 1.0864 1.0852 1.0851 1.0809 1.0811 1.0811 1.0809 1.0840 1.0841 1.0678 1.0678 1.0675 1.0675 1.0643 1.0643 1.0620 1.0620 1.0601 1.0601 1.0967 1.0967 1.1023 1.1023 1.1023 1.1023 1.0954 1.0954 1.0975 1.0975
irintensity: 1.0518 0.3809 0.0307 0.0137 0.1140 0.0092 0.0229 0.8866 1.3248 0.0212 0.4266 0.0625 0.0314 6.1691 0.2282 0.2780 3.4084 0.0337 1.0256 2.8163 1.1899 10.6139 0.8717 2.5379 0.6776 43.1398 0.7456 2.9956 1.5059 5.1272 25.0009 4.1344 2.7911 22.5325 26.6226 132.4293 1.6039 6.6639 1.0297 51.3970 9.4439 245.7226 0.6047 20.3701 23.9055 1.7782 10.9576 234.1917 3.3608 71.2662 32.0506 11.2964 20.6119 0.0932 8.1493 11.5825 0.0007 0.6398 6.2330 0.8502 21.6336 17.4990 0.4756 5.3054 388.9399 34.1564 0.7608 5.7574 0.8796 10.4009 9.2656 0.4367 188.6535 11.3321 1071.2676 71.3336 0.9792 1221.5470 3.9384 0.7827 11.2007 3.8360 3.4664 2.1201 2.3616 37.5645 2.0083 0.2679 2.6209 16.2273 1.1837 2.0059 0.0312 1.6930 0.0716 0.8403 0.8216 1.4502 0.5409 1.7509 7.8275 0.3876 1.1355 12.5247 19.4736 4.8956 19.2261 14.7773 16.0661 6.0659 3.5955 16.1473 23.9489 3.8827 123.4462 7.9764 93.9913 1.5899 13.0539 11.1011 19.2758 45.0492 34.5520 64.2319 1.9380 36.2310 92.0089 19.4459 0.8773 4.8109 13.3946 5.0949
temp: 298.150 k
press: 1.00000 atm
elementType: 17 17 17 17 17 17 15 15 15 15 7 7 7 7 7 7 6 6 6 6 6 6 6 6 6 6 1 1 1 1 1 1 1 1 1 1 1 1 1 1 1 1 1 1 1 1
symmnumber: 1
zpe: 848129.5 jmol-1
zpe.correction: 0.323035 hartree
zpe.thermalcorrener: 0.355896 hartree
zpe.thermalcorrenthalpy: 0.356840 hartree
zpe.thermalcorrgfe: 0.252228 hartree
zpe.sumelectzpe: -4844.772712 hartree
zpe.sumelectthermal: -4844.739851 hartree
zpe.sumelectthermalent: -4844.738907 hartree
zpe.sumelectthermalfe: -4844.843519 hartree
dipole: 0.0005 -0.0001 -5.6810
dipole: 5.6810
quadrupole: -176.5211 -244.1318 -240.5424
quadrupole: 3.5212 0.0050 0.0003
quadrupole: 43.8773 -23.7333 -20.1440 3.5212 0.0050 0.0003
hfenergy: -4845.0957475 hartree
pointgroup: C01 [X(C10H20Cl6N6P4)]
dipole: -0.0001872 -0.0000388 2.2350723 debye
polarizability: 387.917051|14.0871582|351.0843606|0.0054557|0.0017905|320.6984968 unknown
InChI: InChI=1S/C10H20N6P4.6Cl/c1-3-7-15(8-4-1)19-11-17-13-20(14-18-12-19)16-9-5-2-6-10-16;;;;;;/h1-10H2;;;;;;
charge 0 multiplicity 1
46 atoms
Cl 2.684698 -1.112104 -3.435125
Cl -2.686015 1.111957 -3.435513
Cl 0.960152 3.206352 0.821374
Cl 0.096873 3.858246 -2.47517
Cl -0.962146 -3.206664 0.8211
Cl -0.098356 -3.858415 -2.475337
P  2.109538 -0.307007 -1.359307
P  -2.111197 0.30679 -1.359626
P  0.324591 2.124695 -1.072685
P  -0.326295 -2.124924 -1.072814
N  3.502523 -0.201116 -0.379366
N  -3.504338 0.200874 -0.379909
N  1.584212 1.262791 -1.742586
N  -1.585815 -1.262995 -1.74287
N  1.111857 -1.433302 -0.581863
N  -1.113638 1.433058 -0.581986
C  4.101958 -1.430095 0.209526
C  4.411848 0.974285 -0.482474
C  -4.103858 1.429835 0.208932
C  -4.413654 -0.97452 -0.483202
C  4.63802 -1.103302 1.621118
C  4.93497 1.325907 0.926963
C  -4.640141 1.102994 1.620428
C  -4.937009 -1.326186 0.926138
C  5.606732 0.101286 1.590142
C  -5.608861 -0.101582 1.589254
H  4.927377 -1.782805 -0.444877
H  3.32689 -2.212214 0.256209
H  3.854962 1.816092 -0.924987
H  5.258229 0.721196 -1.155936
H  -4.929174 1.782573 -0.445587
H  -3.328792 2.211948 0.255762
H  -3.8567 -1.816316 -0.92565
H  -5.259924 -0.721403 -1.156793
H  5.143692 -2.003509 2.018916
H  3.78034 -0.882047 2.283774
H  4.086497 1.677063 1.544017
H  5.650926 2.164438 0.835047
H  -5.145865 2.003191 2.018183
H  -3.782565 0.881704 2.283208
H  -4.088643 -1.677377 1.543316
H  -5.652963 -2.164703 0.834074
H  5.933864 0.353235 2.615733
H  6.518464 -0.172167 1.019691
H  -5.936159 -0.353564 2.614784
H  -6.520501 0.171905 1.01867
