program: Gaussian 09
title: 000246238
version: EM64L-G09RevD.01
frameworkgroup: C1[X(C8H32N12P4)]
method: RPBEPBE
basis: SDD
operation: Freq
keyword: #p
keyword: freq=noraman
keyword: PBEPBE/SDD
title: #p freq=noraman PBEPBE/SDD
converged: YES YES NO NO
title: Mulliken charges:
elementType: P P P P N N N N N N N N N N N N C C C C C C C C H H H H H H H H H H H H H H H H H H H H H H H H H H H H H H H H
charge: 1.276914 1.326544 1.326375 1.276870 -0.914017 -0.838586 -0.838623 -0.914038 -0.692785 -0.621467 -0.677746 -0.687391 -0.687107 -0.677777 -0.692675 -0.621519 -0.578941 -0.598873 -0.568737 -0.582572 -0.582618 -0.568734 -0.578930 -0.598895 0.347215 0.305456 0.342166 0.383335 0.383175 0.342128 0.347143 0.305422 0.219249 0.209884 0.275756 0.272597 0.214579 0.218969 0.217696 0.226849 0.239760 0.224814 0.244770 0.214677 0.224817 0.244801 0.214680 0.239845 0.217693 0.226808 0.275701 0.219279 0.209888 0.218950 0.272651 0.214576
chargesum: 0.00000
title: Mulliken charges with hydrogens summed into heavy atoms:
elementType: P P P P N N N N N N N N N N N N C C C C C C C C
charge: 1.276914 1.326544 1.326375 1.276870 -0.914017 -0.838586 -0.838623 -0.914038 -0.345570 -0.316012 -0.335580 -0.304057 -0.303932 -0.335649 -0.345533 -0.316097 0.125947 0.107271 0.115569 0.101690 0.101680 0.115612 0.125939 0.107282
polarizability: 2.92934485e+02 -5.65924994e-02 2.83064842e+02 9.01722863e-03 5.98968458e-03 2.42683264e+02
1716.lowfreq: -16.0081 -3.4915 -3.3362 -0.0016 -0.0014 -0.0006 16.5276 24.2856 41.3545
frequency: 16.4736 24.2673 40.7633 57.7282 62.8538 63.4550 67.7994 70.4063 74.4577 78.4863 90.8123 94.8333 99.7804 106.4360 113.7395 116.8606 119.2738 120.5906 123.8244 129.8360 137.2909 138.9602 141.9528 153.7774 156.7332 162.9976 170.8221 173.3621 185.5099 186.4112 214.6901 251.4478 257.3158 263.0908 269.9590 280.5235 285.5606 296.8373 314.8423 320.1506 337.1384 370.0258 381.7864 386.1726 399.2183 404.0945 421.9176 440.5009 444.5322 449.3096 459.5755 462.0818 463.4327 493.8522 516.0142 516.9775 557.0051 607.1176 612.7256 686.7521 696.3900 718.7762 737.0064 753.6463 776.6121 778.6022 796.4384 797.6176 828.0297 854.2277 978.3882 1033.3444 1038.0632 1060.3258 1061.6552 1075.1751 1093.8005 1095.7513 1103.2632 1103.6815 1107.9145 1108.9222 1109.2473 1109.3197 1110.7841 1112.1058 1113.1670 1114.6096 1118.7667 1119.1995 1123.2832 1125.0145 1129.2635 1129.4392 1133.8637 1134.7586 1137.9357 1145.1610 1360.0257 1361.2117 1369.9229 1372.0731 1377.0082 1377.7705 1415.9543 1418.1971 1425.6384 1426.5542 1431.4615 1431.6471 1432.4272 1433.0240 1441.7469 1443.4431 1468.6034 1468.6398 1471.6840 1473.8237 1475.1433 1475.1821 1483.4655 1483.5612 1486.7772 1487.8894 1489.0951 1489.4338 1490.1149 1490.5612 1497.0730 1498.2752 2941.3120 2942.0125 2947.5165 2947.5847 2948.4619 2948.7828 2949.7894 2950.6191 3028.2210 3028.5232 3028.5835 3028.6947 3037.8997 3037.9647 3039.0359 3039.1358 3072.4087 3072.6338 3073.9206 3074.0086 3077.4126 3077.4318 3095.2167 3095.2735 3317.8822 3320.6379 3442.6667 3442.8135 3572.9937 3573.0871 3582.0642 3582.2273
redmass: 4.1471 3.8513 3.5787 3.0372 2.8829 2.8595 2.7055 2.7152 2.5024 3.6093 2.2395 1.4512 1.9653 1.4297 2.7114 1.5685 1.3077 2.3489 2.1357 1.9646 1.2075 2.0033 1.4112 2.8242 4.1770 3.3221 1.4362 1.2751 2.2475 3.2869 3.6514 4.8272 4.3082 5.6951 5.2560 3.8575 5.0946 4.4388 3.4890 3.8275 5.5144 3.1991 1.6681 2.2619 5.5763 5.2612 6.4915 2.9025 4.3701 1.6657 2.8734 2.1735 2.7232 2.8886 2.6928 2.4754 2.6454 3.4370 5.2728 3.4730 4.5288 3.1144 3.2874 3.2413 3.7031 3.9228 1.9539 1.7219 1.8969 1.7573 13.6845 7.7920 10.6605 3.0646 3.0600 5.5096 1.5661 1.6296 2.1548 2.0930 1.4239 1.6331 1.3742 1.3455 1.4996 1.3742 1.3560 1.4265 1.8889 1.7762 1.4699 1.4949 1.4895 1.4946 2.4694 2.4525 3.1438 3.6523 1.2544 1.2541 1.3491 1.3408 1.3462 1.3448 1.1402 1.1364 1.1274 1.1278 1.1336 1.1374 1.1288 1.1225 1.1683 1.1819 1.0507 1.0504 1.0490 1.0517 1.0545 1.0535 1.0458 1.0458 1.0452 1.0448 1.0470 1.0465 1.0437 1.0458 1.0459 1.0479 1.0400 1.0398 1.0401 1.0397 1.0373 1.0382 1.0395 1.0393 1.0945 1.0982 1.0941 1.0987 1.0943 1.0943 1.0945 1.0944 1.1000 1.1000 1.0985 1.0985 1.1001 1.1001 1.0984 1.0984 1.0807 1.0812 1.0742 1.0742 1.0760 1.0760 1.0761 1.0761
irintensity: 1.3772 0.0013 0.0851 1.4313 0.9481 3.6722 5.9730 0.0460 0.2259 0.5656 4.1762 0.3011 0.1986 1.9008 0.6892 0.1709 0.0351 0.0225 0.7510 0.0294 1.2393 0.0249 0.0528 2.8212 0.2349 0.3263 0.7031 1.7760 3.4027 6.1878 5.4814 4.7327 3.8284 1.8976 2.7066 0.4159 21.9097 37.3503 0.0394 66.1775 3.2574 5.6586 7.9778 18.0442 26.0500 0.0717 14.6117 96.6084 0.9556 32.7267 3.2344 8.3131 277.0545 153.5155 3.2617 63.4887 64.0184 135.1351 23.3668 176.0326 223.5961 143.0968 23.4269 57.0645 65.7021 39.3916 47.4373 64.2304 116.0558 99.9027 3.8371 1107.1257 81.0862 22.5415 36.7068 1227.1513 27.5754 104.2949 69.0566 44.9435 0.2424 14.1718 0.2596 17.5006 39.6852 63.2340 3.8225 27.4291 3.2920 67.9467 5.2209 79.2727 17.6963 28.6263 3.9003 44.4214 9.8211 10.0438 0.9748 40.7598 15.0627 174.6076 32.7260 1.9476 8.6369 0.4943 9.3162 5.6943 0.1950 15.4097 3.3289 2.5630 22.2523 100.7774 0.4064 4.3210 10.0163 20.5808 4.6159 19.8386 2.3756 8.0513 5.7482 27.0219 19.4656 3.3965 22.9025 0.1116 7.1286 0.6015 75.1466 133.5838 94.9652 106.4846 317.4055 7.2238 196.1989 27.6792 45.1069 80.7790 33.1961 31.4756 36.7823 43.2048 9.0334 54.1472 22.5276 22.5146 8.5953 8.6505 43.2754 7.5252 11.3759 7.3138 3.4232 360.7290 1.4349 1.5295 35.3182 15.5488 37.3856 25.9552
temp: 298.150 k
press: 1.00000 atm
elementType: 15 15 15 15 7 7 7 7 7 7 7 7 7 7 7 7 6 6 6 6 6 6 6 6 1 1 1 1 1 1 1 1 1 1 1 1 1 1 1 1 1 1 1 1 1 1 1 1 1 1 1 1 1 1 1 1
symmnumber: 1
zpe: 1199692.6 jmol-1
zpe.correction: 0.456939 hartree
zpe.thermalcorrener: 0.492804 hartree
zpe.thermalcorrenthalpy: 0.493748 hartree
zpe.thermalcorrgfe: 0.388529 hartree
zpe.sumelectzpe: -2343.857629 hartree
zpe.sumelectthermal: -2343.821763 hartree
zpe.sumelectthermalent: -2343.820819 hartree
zpe.sumelectthermalfe: -2343.926038 hartree
dipole: 0.0005 -0.0008 1.6616
dipole: 1.6616
quadrupole: -158.7874 -166.7110 -168.7605
quadrupole: -1.0166 -0.0073 -0.0061
quadrupole: 5.9656 -1.9580 -4.0075 -1.0166 -0.0073 -0.0061
hfenergy: -2344.3145674 hartree
pointgroup: C01 [X(C8H32N12P4)]
dipole: 0.0026885 0.0007935 0.6537248 debye
polarizability: 284.1262641|-3.0590827|291.872407|-0.1628585|-0.018567|242.6839207 unknown
InChI: InChI=1S/C8H32N12P4/c1-9-21(10-2)17-22(11-3,12-4)19-24(15-7,16-8)20-23(13-5,14-6)18-21/h9-16H,1-8H3
charge 0 multiplicity 1
56 atoms
P  0.696543 2.03044 -0.73474
P  1.965502 -0.682856 -0.230699
P  -1.966585 0.678292 -0.21703
P  -0.701318 -2.036026 -0.726139
N  2.007649 0.982829 -0.551887
N  -0.917747 1.680638 -1.116241
N  0.910318 -1.687455 -1.120197
N  -2.010892 -0.988114 -0.534055
N  1.235599 3.064824 -2.009323
N  0.58956 2.922354 0.821336
N  3.597182 -1.070712 -0.61973
N  1.790743 -1.137852 1.441494
N  -1.780226 1.137106 1.452991
N  -3.601092 1.065397 -0.594842
N  -1.250235 -3.071835 -1.995393
N  -0.582778 -2.925887 0.830251
C  0.348192 3.894816 -2.830759
C  1.835052 3.401741 1.466274
C  4.10576 -2.4450 -0.561972
C  2.504412 -0.448754 2.523679
C  -2.486724 0.45005 2.541227
C  -4.109483 2.439684 -0.535608
C  -0.369184 -3.90197 -2.823514
C  -1.823319 -3.404129 1.485481
H  2.184146 2.869452 -2.330373
H  -0.158578 3.630293 0.78122
H  4.043415 -0.406685 -1.254362
H  0.91389 -1.647317 1.648928
H  -0.900748 1.644728 1.653588
H  -4.051929 0.400261 -1.225052
H  -2.201356 -2.87698 -2.309091
H  0.165008 -3.633893 0.785412
H  0.508587 3.693144 -3.906942
H  0.494273 4.979259 -2.65026
H  -0.697189 3.624108 -2.599422
H  2.583574 2.594602 1.403066
H  1.640415 3.623293 2.531668
H  2.259767 4.307343 0.984628
H  5.203958 -2.428316 -0.439664
H  3.853285 -3.046277 -1.459638
H  3.676047 -2.94835 0.322645
H  1.98113 0.460142 2.888115
H  3.504653 -0.148415 2.16336
H  2.645004 -1.139137 3.376221
H  -1.962118 -0.459335 2.902571
H  -3.490124 0.150966 2.188749
H  -2.61974 1.14149 3.394117
H  -3.672703 2.944762 0.344547
H  -5.206657 2.423044 -0.404379
H  -3.864429 3.039302 -1.436443
H  0.677998 -3.633231 -2.598169
H  -0.535624 -3.698554 -3.898477
H  -0.515922 -4.986393 -2.643536
H  -2.251439 -4.310821 1.00893
H  -2.572438 -2.597234 1.426192
H  -1.620681 -3.623432 2.549851
