program: Gaussian 09
title: 000246215
version: EM64L-G09RevD.01
frameworkgroup: C1[X(C9H10N2O)]
method: RPBEPBE
basis: SDD
operation: Freq
keyword: #p
keyword: freq=noraman
keyword: PBEPBE/SDD
title: #p freq=noraman PBEPBE/SDD
converged: NO YES NO NO
title: Mulliken charges:
elementType: O N N C C C C C C C C C H H H H H H H H H H
charge: -0.212712 0.053187 -0.363649 0.440800 -0.382814 -0.363102 -0.223868 -0.218888 -0.233568 -0.372992 0.249518 -0.788691 0.221316 0.281554 0.227990 0.230465 0.199458 0.230539 0.283276 0.236439 0.269443 0.236300
chargesum: 0.00000
title: Mulliken charges with hydrogens summed into heavy atoms:
elementType: O N N C C C C C C C C C
charge: -0.212712 0.053187 -0.080372 0.440800 -0.161499 -0.081548 0.004122 0.011576 -0.003029 -0.173534 0.249518 -0.046510
polarizability: 2.29867409e+02 -2.01364527e+00 1.17504112e+02 -2.10145424e-03 -5.70214456e-04 5.01819212e+01
1716.lowfreq: -79.4581 -0.0006 -0.0003 0.0001 4.9832 7.4426 18.0429 53.2933 66.2427
frequency: -79.3794 53.2902 66.2387 70.3356 148.5682 205.4227 233.4694 268.4665 314.5147 401.7389 405.0692 461.9069 511.5327 570.1137 609.5806 616.7308 631.4032 651.5408 699.7581 772.3249 830.9422 856.0548 920.0728 945.1062 950.9043 958.7501 985.1646 987.5483 1006.4919 1023.3124 1029.6577 1075.2051 1096.5310 1173.3737 1184.8639 1210.6752 1240.7527 1315.3934 1343.9190 1372.7486 1388.9915 1438.1535 1448.9855 1467.8941 1480.9477 1506.4160 1569.9102 1595.8961 1612.9721 1656.8705 2949.9801 2987.2719 3072.6461 3113.8133 3129.6503 3137.7874 3142.5117 3157.3644 3168.5131 3355.8706
redmass: 1.0708 4.8884 3.7310 5.1558 4.8704 4.8281 2.7187 5.5086 4.2941 4.1375 2.8350 4.9810 2.8863 3.1992 5.4090 5.9412 1.1930 5.9294 1.7677 1.7433 4.6481 1.2526 1.3727 1.8343 1.5781 5.0306 1.3703 6.2903 1.3355 2.1532 1.6635 2.2420 2.5368 1.0584 1.1134 2.8102 1.9194 1.5442 1.4361 1.2303 6.2546 2.2892 1.1094 1.0472 2.0819 1.8437 6.1512 5.6746 6.0331 7.1954 1.0862 1.0382 1.0984 1.0876 1.0868 1.0978 1.0921 1.0961 1.1004 1.0752
irintensity: 0.0388 6.0745 4.5278 6.4599 0.1773 0.9767 22.1429 0.5112 1.8717 7.9607 0.1051 5.1429 6.5844 9.5020 1.9484 0.4621 84.5533 18.5888 53.5312 44.4056 1.1356 0.6464 4.5048 13.2437 36.5256 31.0825 0.0371 0.5997 1.3675 13.4194 7.8120 68.2287 55.4678 0.1587 0.3265 327.6627 77.9766 9.2639 10.4794 52.4626 2.5761 7.6207 72.1751 20.7186 46.1372 182.5720 2.0786 0.5567 0.5847 253.4986 64.7357 8.1777 16.6545 10.3845 0.2992 8.9962 26.2204 22.8069 20.4392 12.1077
temp: 298.150 k
press: 1.00000 atm
elementType: 8 7 7 6 6 6 6 6 6 6 6 6 1 1 1 1 1 1 1 1 1 1
symmnumber: 1
zpe: 452080.3 jmol-1
zpe.correction: 0.172188 hartree
zpe.thermalcorrener: 0.182749 hartree
zpe.thermalcorrenthalpy: 0.183693 hartree
zpe.thermalcorrgfe: 0.134890 hartree
zpe.sumelectzpe: -532.791371 hartree
zpe.sumelectthermal: -532.780810 hartree
zpe.sumelectthermalent: -532.779866 hartree
zpe.sumelectthermalfe: -532.828669 hartree
dipole: 0.5477 -5.0868 0.0015
dipole: 5.1161
quadrupole: -57.3368 -66.3698 -74.3674
quadrupole: 14.5448 -0.0047 0.0009
quadrupole: 8.6879 -0.3451 -8.3428 14.5448 -0.0047 0.0009
hfenergy: -532.9635597 hartree
pointgroup: C01[X(C9H10N2O1)]
dipole: -0.2404978 1.9974358 -0.0630061 debye
dipolederiv: -0.6706545 -0.0040302 -0.0006871 0.7650246 -0.960414 0.0216918 -0.0250165 0.0200247 -0.3242344 0.7817648 -0.1131105 0.0056544 0.6175956 -0.2891808 0.0076101 -0.0173659 0.0060278 -0.0904957 -2.0436961 0.4452482 -0.0179546 0.0317704 -0.1506653 -0.0054954 -0.004892 -0.0046424 -0.3320193 0.1081456 -0.0048464 0.0003207 -0.0273399 -0.0919833 0.0036932 0.0010114 0.0037127 0.0264961 -0.084875 0.0738796 -0.0021277 -0.0425609 0.0828157 -0.0086392 0.0016604 -0.0084037 -0.1863841 -0.0737849 -0.0774236 0.0025942 -0.0310055 -0.0382932 -0.0030694 0.0011864 -0.0031514 -0.1327553 0.0692499 -0.1149474 0.0041304 -0.2046447 -0.0082578 -0.0048978 0.0069402 -0.0046964 -0.1486432 -0.1111749 0.0594671 -0.0018074 0.1192624 0.1548875 -0.0093428 -0.0037465 -0.0095049 -0.1475664 -0.0063516 0.0398876 -0.0008861 0.0073837 -0.0262467 -0.0042792 0.0001722 -0.0041932 -0.162428 0.2014269 0.0719542 -0.001662 0.4044987 0.4395183 -0.0163992 -0.012241 -0.0171481 -0.1107798 2.1594201 -0.2584979 0.0128398 -1.2132032 1.2813439 -0.0374207 0.0433222 -0.0352586 0.1764203 -0.4292757 -0.1394582 0.0031969 -0.2802247 -0.1502949 0.0059442 0.0069808 0.0062075 0.0669698 0.0830612 -0.075468 0.0022246 -0.0370282 -0.1107856 0.0084456 0.0010138 0.0083807 0.1582393 0.048311 0.0801417 -0.0027884 0.0587032 0.0532086 0.0034365 -0.0021109 0.0034792 0.1573141 -0.0606104 0.1022748 -0.003736 0.1244068 -0.0056159 0.0055302 -0.004457 0.0054782 0.1602459 0.0605185 -0.0388099 0.0010129 -0.0736593 -0.1105468 0.0082946 0.0021165 0.008394 0.15607 -0.0217967 -0.0496778 0.0011053 -0.0884676 -0.1975986 0.0117317 0.002368 0.0117598 0.1804987 -0.1181503 -0.0642533 0.0013857 -0.0702149 0.0689947 0.0028188 0.0015847 0.0028266 0.163162 0.0074309 0.0086614 -0.0010163 -0.1173224 -0.0360642 0.0110077 0.0029603 0.0113102 0.3240702 0.0630335 0.0029097 0.0374958 -0.0321751 0.0217522 -0.1091752 -0.0105491 -0.1128891 -0.0265744 -0.0252733 0.0558188 -0.0019453 0.1210538 0.0385566 0.003057 -0.0038414 0.0029898 0.1323556 0.0632809 0.00028 -0.0373498 -0.0318529 0.0348699 0.1054576 0.0129034 0.1092968 -0.0399613 unknown
polarizability: 229.8992755|-0.5936171|117.4042806|0.428379|-2.1227359|50.2498862 unknown
InChI: InChI=1S/C9H10N2O/c1-8(12)11-10-7-9-5-3-2-4-6-9/h2-7,11H,1H3
charge 0 multiplicity 1
22 atoms
O  3.527496 -1.46227 0.055898
N  1.137945 0.046375 0.00283
N  2.402512 0.601295 -0.011639
C  -1.269689 0.370623 -0.012655
C  -2.345114 1.300979 -0.044437
C  -1.559913 -1.024139 0.030849
C  -3.682849 0.851514 -0.033231
C  -2.895783 -1.467425 0.041861
C  -3.96309 -0.533936 0.009913
C  0.110405 0.87035 -0.025524
C  3.560396 -0.208428 0.016467
C  4.847878 0.619347 -0.006217
H  -2.130105 2.377055 -0.078062
H  -0.724623 -1.731404 0.055127
H  -4.503567 1.576999 -0.05804
H  -3.111578 -2.541231 0.075434
H  0.238271 1.973996 -0.05996
H  -5.001146 -0.884761 0.018612
H  2.524617 1.6268 -0.043375
H  4.90931 1.291487 0.869939
H  5.703696 -0.069898 0.016171
H  4.912531 1.237474 -0.921063
