program: Gaussian 09
title: 000246207
version: EM64L-G09RevD.01
frameworkgroup: C1[X(C21H36O2)]
method: RPBEPBE
basis: SDD
operation: Freq
keyword: #pfreq=noraman
keyword: PBEPBE/SDD
title: #p freq=noraman PBEPBE/SDD
converged: YES YES NO NO
title: Mulliken charges:
elementType: O O C C C C C C C C C C C C C C C C C C C C C H H H H H H H H H H H H H H H H H H H H H H H H H H H H H H H H H H H H
charge: -0.456249 -0.443577 -0.107238 -0.113278 -0.193919 0.389158 0.417111 -0.076177 -0.542386 -0.560136 0.222856 -0.538074 -0.054274 -0.548018 -0.489693 -0.538359 -0.560527 -0.797609 -0.869553 -0.444421 -0.056659 -0.817376 -0.792085 0.240075 0.186408 0.212390 0.183180 0.223917 0.214191 0.199478 0.214540 0.214282 0.192635 0.223158 0.217892 0.221230 0.242837 0.211837 0.205739 0.213191 0.198871 0.221828 0.215099 0.214377 0.240676 0.222131 0.228856 0.222372 0.221537 0.211368 0.177928 0.213576 0.241981 0.224349 0.222072 0.210035 0.217372 0.321864 0.327213
chargesum: 0.00000
title: Mulliken charges with hydrogens summed into heavy atoms:
elementType: O O C C C C C C C C C C C C C C C C C C C C C
charge: -0.134384 -0.116364 0.132837 0.073131 0.018470 0.389158 0.417111 0.107002 -0.104279 -0.146118 0.222856 -0.131158 0.168884 -0.108896 -0.035019 -0.119429 -0.139828 -0.127457 -0.196194 -0.011516 0.121269 -0.137470 -0.142606
polarizability: 2.66639698e+02 2.04074475e+00 2.16490314e+02 2.96445988e-01 -1.17445219e+00 1.81217580e+02
1716.lowfreq: -13.6226 -1.8698 -0.0011 -0.0008 -0.0004 10.2049 37.5493 57.1744 84.4132
frequency: 37.4133 56.6719 84.4054 86.7771 109.7544 124.9851 140.2995 179.5529 182.8682 194.8409 200.2307 210.3447 227.6604 241.9555 247.7562 257.8196 272.4376 286.6241 292.0265 294.8151 309.4224 312.5636 320.5376 330.2563 343.5511 364.3356 369.6489 374.3499 384.5104 393.8503 427.1983 440.6196 454.5672 464.7591 472.7407 492.9224 524.4917 529.9554 549.6871 560.0009 571.6302 611.8137 650.4099 686.7732 735.3186 790.1397 796.0568 809.2157 824.3199 842.7928 847.3082 882.4626 886.1461 898.4718 902.1758 920.3250 934.0102 935.8837 944.6354 960.5015 968.0788 984.7388 985.2127 996.7646 999.1571 1007.8615 1017.2395 1033.2911 1041.2209 1052.2463 1061.7939 1070.4901 1080.0306 1086.1540 1090.0371 1095.3554 1110.2816 1118.3908 1124.5251 1133.0017 1139.6090 1155.5309 1160.4146 1162.8113 1176.5564 1183.0652 1202.6430 1204.9767 1219.0006 1224.9105 1231.6019 1250.3345 1251.0917 1253.3540 1266.2568 1274.3018 1279.6514 1285.5634 1288.6553 1299.4758 1305.2316 1307.7751 1315.0678 1319.5944 1321.6063 1325.7005 1329.2663 1335.5148 1339.8541 1346.2451 1348.1028 1352.4444 1356.0541 1358.3429 1383.4500 1385.1679 1395.3325 1399.1960 1406.1466 1455.0339 1460.4865 1463.7471 1464.8468 1465.9920 1467.4125 1469.5812 1471.6750 1475.6978 1477.0811 1481.2142 1483.9100 1487.8546 1492.8274 1493.3620 1497.3909 2893.8876 2902.0447 2913.5628 2915.5237 2934.2293 2950.9754 2952.4432 2961.2934 2966.5684 2969.5621 2971.8537 2977.3983 2984.2148 2989.8085 2990.2997 2997.4648 2998.1369 3011.8086 3013.3990 3014.8500 3029.0601 3032.1744 3042.1298 3048.4588 3056.4300 3057.5186 3061.7256 3071.3443 3073.7406 3078.9169 3081.5256 3082.8681 3084.3314 3094.9574 3539.2096 3549.9658
redmass: 4.0289 3.3120 3.6504 2.1276 3.5779 2.2606 1.8164 1.8453 1.4315 3.5649 2.5670 1.8976 1.5702 1.7876 1.9389 2.2980 1.2472 2.0735 1.8078 1.4396 1.9870 1.4505 2.2972 2.3499 2.7365 2.8574 3.4232 2.2563 2.9875 3.1194 3.3110 2.5143 2.0188 3.0670 3.0585 2.9938 2.5633 2.6396 3.5481 3.0071 3.0240 3.5359 2.5354 2.6287 2.8034 1.5820 1.7956 2.3331 1.9309 2.5085 2.2804 2.1749 1.6223 1.5661 2.1980 1.8729 1.7697 1.7005 1.8218 2.2483 1.7837 2.2070 2.1010 2.3313 2.2991 1.6847 2.0714 1.8132 2.1594 1.9347 2.0695 2.3905 1.6090 2.0052 1.8782 2.1756 1.4498 1.9542 2.0600 2.0118 1.8142 2.0870 2.1385 1.8923 1.9737 2.0682 1.9268 1.6695 1.7354 1.7379 1.4936 1.4635 1.3035 1.4125 1.5507 1.4156 1.3624 1.5524 1.2447 1.3085 1.4142 1.3896 1.4008 1.5212 1.6130 1.3284 1.3765 1.4015 1.4988 1.4418 1.3431 1.4818 1.3889 1.5191 1.2164 1.2187 1.2321 1.1970 1.6327 1.0736 1.0867 1.0758 1.0774 1.0761 1.0693 1.0517 1.0685 1.0622 1.0722 1.0814 1.0486 1.0829 1.0623 1.0670 1.0642 1.0808 1.0799 1.0830 1.0796 1.0653 1.0645 1.0601 1.0799 1.0406 1.0769 1.0398 1.0586 1.0574 1.0569 1.0453 1.0397 1.0615 1.0975 1.0669 1.0940 1.0943 1.1007 1.1004 1.1000 1.1024 1.0985 1.0975 1.0985 1.0974 1.1029 1.0991 1.0981 1.0973 1.0984 1.0656 1.0659
irintensity: 0.6100 0.1236 0.7005 0.8748 1.5086 1.5757 0.8482 0.3236 0.3149 1.7145 0.1056 0.3044 0.4224 0.8893 1.1116 9.2737 15.6598 14.8751 30.5230 36.0851 30.9993 125.4933 18.5608 8.8420 6.1626 5.2876 0.4996 1.7361 5.4187 2.5919 0.7577 1.9761 1.8320 8.0781 10.0284 2.4209 2.9425 0.7498 1.2513 3.7132 2.8827 1.7440 7.0721 0.4032 3.8284 4.0037 1.4620 0.6661 0.3648 2.3586 2.2231 10.4380 5.0932 4.7392 28.8623 1.7991 1.6673 2.7186 2.2866 27.9057 9.3172 3.8329 3.1751 19.7280 39.9048 8.3644 17.8367 2.9498 3.9149 27.0070 11.8248 3.5956 56.1824 22.6139 30.8814 0.4792 2.6773 1.4021 1.5344 10.3307 22.2446 1.6920 14.7384 23.4515 1.4092 2.4388 2.4841 0.7806 4.0209 7.3529 10.2445 0.8831 5.0749 16.8030 6.9509 10.7871 14.4320 10.1323 4.1100 2.6935 0.6606 0.1317 1.2453 4.8555 8.5751 0.4749 2.3271 0.2374 0.5685 1.7844 18.0359 4.2943 8.6381 2.8283 29.5827 13.6786 18.7027 27.6396 1.8279 0.9934 6.0299 14.6940 9.2136 1.0072 10.2164 10.6110 3.9800 12.3452 2.0874 2.1953 15.4031 10.2214 1.3031 1.9032 16.3090 2.9550 10.8996 47.9280 27.8036 19.1348 47.4495 35.2364 16.1381 31.0521 28.4761 36.7660 45.3421 20.9571 28.3588 19.2789 36.3051 21.1524 27.3770 22.3958 57.2430 56.0474 54.6475 49.7040 25.3652 28.4550 78.1384 22.2209 41.4642 35.3341 47.2443 23.5480 60.9955 26.6905 28.0036 3.6091 2.6161
temp: 298.150 k
press: 1.00000 atm
elementType: 8 8 6 6 6 6 6 6 6 6 6 6 6 6 6 6 6 6 6 6 6 6 6 1 1 1 1 1 1 1 1 1 1 1 1 1 1 1 1 1 1 1 1 1 1 1 1 1 1 1 1 1 1 1 1 1 1 1 1
symmnumber: 1
zpe: 1391718.5 jmol-1
zpe.correction: 0.530078 hartree
zpe.thermalcorrener: 0.553475 hartree
zpe.thermalcorrenthalpy: 0.554420 hartree
zpe.thermalcorrgfe: 0.481071 hartree
zpe.sumelectzpe: -970.437557 hartree
zpe.sumelectthermal: -970.414159 hartree
zpe.sumelectthermalent: -970.413215 hartree
zpe.sumelectthermalfe: -970.486563 hartree
dipole: 0.0199 0.7341 -1.5723
dipole: 1.7353
quadrupole: -167.9127 -140.2013 -142.1405
quadrupole: 14.0864 1.8319 0.0852
quadrupole: -17.8278 9.8835 7.9443 14.0864 1.8319 0.0852
hfenergy: -970.9676347 hartree
pointgroup: C01 [X(C21H36O2)]
dipole: 0.0023611 0.2920939 -0.6170764 debye
polarizability: 266.5955823|2.5308174|216.5468635|-0.0400481|-0.9981839|181.2051468 unknown
InChI: InChI=1S/C21H36O2/c1-13-11-15-16(19(2)8-5-14(22)12-18(13)19)6-9-20(3)17(15)7-10-21(20,4)23/h13-18,22-23H,5-12H2,1-4H3
charge 0 multiplicity 1
59 atoms
O  -5.308253 -0.884544 0.311087
O  6.069856 -0.585252 -0.423986
C  -0.502092 0.702885 0.351087
C  0.239999 -0.568578 -0.175149
C  -1.95024 0.693185 -0.185966
C  -2.763652 -0.575937 0.220944
C  1.753186 -0.608438 0.267885
C  2.433063 0.725976 -0.231736
C  -0.553031 -1.867227 0.15139
C  0.243811 1.990744 -0.062435
C  -4.179812 -0.225564 -0.397055
C  -2.026784 -1.816969 -0.340311
C  1.739685 1.997555 0.340428
C  -2.896483 1.869249 0.168886
C  -4.329015 1.306863 -0.113532
C  2.46875 -1.802243 -0.445006
C  3.968894 0.708089 -0.015333
C  -2.922875 -0.709133 1.761257
C  1.880606 -0.782877 1.807864
C  4.003697 -1.820104 -0.256854
C  4.624413 -0.498117 -0.716262
C  -4.312745 -0.55438 -1.899889
C  2.40139 3.314471 -0.128719
H  -0.537144 0.671696 1.460153
H  0.252355 -0.474912 -1.288544
H  -1.858406 0.671987 -1.29653
H  2.265659 0.754919 -1.336101
H  -0.534491 -2.057286 1.241245
H  -0.058437 -2.734635 -0.324776
H  0.175044 2.112737 -1.166608
H  -0.261108 2.870441 0.38355
H  -2.022672 -1.782527 -1.448417
H  -2.542962 -2.755132 -0.046477
H  1.802737 1.962705 1.449024
H  -2.681943 2.774042 -0.426708
H  -2.783509 2.148783 1.233882
H  -5.002352 1.433044 0.751568
H  -4.805644 1.813082 -0.971925
H  2.235743 -1.755589 -1.530811
H  2.057134 -2.760359 -0.075998
H  4.410582 1.640925 -0.419045
H  4.222272 0.675359 1.062844
H  -3.473985 -1.633402 2.008643
H  -1.947258 -0.749151 2.274384
H  -3.500921 0.126903 2.189078
H  1.531808 -1.785128 2.116567
H  2.926573 -0.6864 2.145393
H  1.287342 -0.037744 2.365771
H  4.271406 -1.981585 0.804345
H  4.450319 -2.654575 -0.828932
H  4.472866 -0.387662 -1.816074
H  -4.231356 -1.642536 -2.08697
H  -5.302642 -0.218634 -2.256476
H  -3.539792 -0.050344 -2.507631
H  3.412806 3.45304 0.292763
H  2.483624 3.344565 -1.233182
H  1.792108 4.183306 0.18431
H  -5.298488 -1.850678 0.086023
H  6.496766 0.272791 -0.677235
