program: Gaussian 09
title: 000246195
version: EM64L-G09RevD.01
frameworkgroup: C1[X(C9H16Cl2N2O2)]
method: RPBEPBE
basis: SDD
operation: Freq
keyword: #p
keyword: freq=noraman
keyword: PBEPBE/SDD
title: #p freq=noraman PBEPBE/SDD
converged: YES YES NO NO
title: Mulliken charges:
elementType: Cl Cl O O N N C C C C C C C C C H H H H H H H H H H H H H H H H
charge: -0.084451 -0.084966 -0.263906 -0.264305 -0.346356 -0.347382 -0.375128 -0.357498 -0.352025 -0.405254 -0.402659 0.282679 0.281926 -0.654962 -0.653405 0.208548 0.183846 0.203027 0.233016 0.227445 0.201649 0.213586 0.258564 0.259835 0.214232 0.321175 0.320958 0.294948 0.295906 0.295933 0.295025
chargesum: 0.00000
title: Mulliken charges with hydrogens summed into heavy atoms:
elementType: Cl Cl O O N N C C C C C C C C C
charge: -0.084451 -0.084966 -0.263906 -0.264305 -0.025181 -0.026424 0.017266 0.078545 0.077069 0.066896 0.071408 0.282679 0.281926 -0.064108 -0.062447
polarizability: 1.31383090e+02 5.47277833e-01 1.50803645e+02 -1.07916867e+00 -4.89613065e+00 1.18019648e+02
1716.lowfreq: -2.3179 -0.0009 0.0003 0.0020 4.2464 4.6861 8.6137 13.2663 14.7301
frequency: 6.6054 12.9648 14.4899 18.0623 38.8862 73.5743 81.9147 107.4109 120.5900 125.9408 150.5244 182.8339 196.9008 250.8020 257.2482 324.4608 330.3377 380.6455 383.5410 465.3913 484.5427 566.8027 574.7794 602.1499 607.0464 641.4741 656.9992 664.7502 666.1518 737.0859 786.4486 811.5699 870.5600 898.0155 906.1247 907.7728 924.5631 962.0921 995.7708 1061.7607 1095.3587 1106.3898 1107.5271 1127.4657 1147.1767 1149.2448 1170.4210 1226.1350 1243.8160 1253.5569 1254.3324 1256.8384 1262.0001 1290.7534 1294.9336 1307.1454 1343.2223 1350.7715 1365.3266 1369.5671 1418.4394 1419.5885 1451.9976 1454.9364 1457.2155 1460.3334 1479.2769 1509.3522 1513.8563 1611.3065 1613.6648 2946.7846 2977.1709 2980.7227 2995.6910 2999.5279 3002.3216 3040.5155 3052.9504 3072.4763 3072.4916 3074.7411 3075.3460 3154.6566 3154.8020 3513.9600 3515.5319
redmass: 11.6439 14.7169 7.5367 5.6659 7.5072 3.7050 2.9968 3.0879 4.8733 1.9577 2.6838 4.8976 4.1391 3.1736 5.0484 3.6705 2.5780 7.6348 8.4968 2.3395 2.7068 3.3346 3.2581 3.6794 3.5094 1.1291 1.1284 5.9095 5.6091 1.2750 1.8651 1.8251 2.1425 3.1552 1.7287 1.7246 2.8120 2.4907 1.7958 2.8314 3.1075 3.7819 3.2637 2.1790 1.1220 1.1373 1.3062 1.3646 1.6329 1.2177 1.2009 1.8280 1.4766 1.2617 1.1377 1.1369 1.3667 1.4424 1.2776 1.4037 1.0913 1.0920 1.1025 1.0970 1.0896 1.0725 1.1030 1.9706 1.9536 7.9551 8.1904 1.0599 1.0612 1.0638 1.0669 1.0828 1.0718 1.0996 1.1011 1.0568 1.0568 1.1027 1.1014 1.1094 1.1094 1.0775 1.0778
irintensity: 1.1075 0.1664 0.5313 0.5751 4.0010 7.8997 21.4053 3.5576 0.6564 1.9586 2.6902 0.3679 18.7701 2.3189 4.7194 13.4448 1.1401 5.2231 14.3347 4.7909 0.3332 8.2272 7.6159 8.1147 8.8175 155.6055 91.2929 14.0747 110.4558 25.7120 0.9362 4.2312 1.6634 3.4099 10.8559 8.9034 0.1386 0.6908 5.8182 8.4200 8.5366 7.6529 3.8940 0.8466 2.0849 0.0624 6.9898 1.5826 3.3125 15.1905 25.4239 3.8309 32.9799 56.1757 3.3287 13.2052 8.7831 0.1498 3.8226 8.5029 24.1449 35.0864 25.4437 31.0181 0.3679 7.5627 19.0056 73.0164 311.0985 187.6208 242.8751 23.0089 1.3048 56.0812 38.0018 20.7489 19.1727 0.9665 104.5108 2.7898 3.5229 8.3025 15.2557 1.3006 1.1387 25.7483 57.3328
temp: 298.150 k
press: 1.00000 atm
elementType: 17 17 8 8 7 7 6 6 6 6 6 6 6 6 6 1 1 1 1 1 1 1 1 1 1 1 1 1 1 1 1
symmnumber: 1
zpe: 655501.1 jmol-1
zpe.correction: 0.249667 hartree
zpe.thermalcorrener: 0.267543 hartree
zpe.thermalcorrenthalpy: 0.268487 hartree
zpe.thermalcorrgfe: 0.196145 hartree
zpe.sumelectzpe: -1531.466131 hartree
zpe.sumelectthermal: -1531.448255 hartree
zpe.sumelectthermalent: -1531.447311 hartree
zpe.sumelectthermalfe: -1531.519654 hartree
dipole: 0.2575 -0.6821 -3.3268
dipole: 3.4057
quadrupole: -121.9121 -105.0004 -106.5125
quadrupole: -0.6260 -0.2453 12.4533
quadrupole: -10.7704 6.1412 4.6292 -0.6260 -0.2453 12.4533
hfenergy: -1531.7157986 hartree
pointgroup: C01 [X(C9H16Cl2N2O2)]
dipole: -0.1347517 0.7746261 -1.0849865 debye
polarizability: 131.3974611|-0.3108506|141.6812014|0.5842859|15.5173525|127.1277206 unknown
InChI: InChI=1S/C9H16Cl2N2O2/c10-6-8(14)12-4-2-1-3-5-13-9(15)7-11/h12-13H,1-7H2
charge 0 multiplicity 1
31 atoms
Cl -2.723604 -2.398584 -1.991755
Cl 2.725569 -2.202731 -1.974565
O  -4.067074 -0.248729 1.205803
O  4.20303 0.102017 1.051651
N  -2.857277 0.348315 -0.704976
N  2.71078 0.551735 -0.695369
C  -0.125576 1.817695 -0.348554
C  -1.422271 2.075744 0.450375
C  1.144165 2.157898 0.463628
C  -2.718952 1.769755 -0.336176
C  2.464919 1.954937 -0.315331
C  -3.511536 -0.544662 0.100774
C  3.550012 -0.25878 0.021883
C  -3.604278 -2.003433 -0.353329
C  3.736114 -1.705504 -0.442094
H  -0.091929 0.751991 -0.654945
H  -0.139376 2.422761 -1.28091
H  -1.457653 3.13935 0.762612
H  -1.421026 1.473099 1.378896
H  1.176265 1.546873 1.386331
H  1.100905 3.218283 0.785832
H  -2.75532 2.371726 -1.263915
H  -3.5950 2.031003 0.28313
H  3.318348 2.269501 0.310272
H  2.462357 2.5707 -1.235474
H  -2.438402 -0.003526 -1.570193
H  2.232278 0.147383 -1.505131
H  -3.143962 -2.657351 0.401107
H  -4.658159 -2.279406 -0.503365
H  4.789497 -1.877713 -0.70638
H  3.427856 -2.394048 0.357665
