program: Gaussian 09
title: 000246194
version: EM64L-G09RevD.01
frameworkgroup: C1[X(C5H9ClO2S)]
method: RPBEPBE
basis: SDD
operation: Freq
keyword: #p
keyword: freq=noraman
keyword: PBEPBE/SDD
title: #p freq=noraman PBEPBE/SDD
converged: YES YES NO NO
title: Mulliken charges:
elementType: Cl S O O C C C C C H H H H H H H H H
charge: -0.075813 0.163537 -0.410498 -0.232988 -0.640367 -0.440727 -0.603041 -0.514938 0.197238 0.272091 0.267754 0.266366 0.268223 0.280507 0.271823 0.277825 0.272132 0.380878
chargesum: 0.00000
title: Mulliken charges with hydrogens summed into heavy atoms:
elementType: Cl S O O C C C C C
charge: -0.075813 0.163537 -0.029620 -0.232988 -0.100523 0.093861 -0.050711 0.035019 0.197238
polarizability: 1.30688556e+02 -7.58953882e+00 8.04453628e+01 -5.70268999e+00 4.40012554e+00 5.60237960e+01
1716.lowfreq: -19.4130 -0.0019 -0.0013 0.0013 2.0285 4.8089 11.1739 32.7773 45.8996
frequency: 10.2339 32.7153 45.5917 67.2804 95.0843 126.0058 195.7812 206.8879 237.4917 314.7235 446.3933 508.5963 564.0530 629.3677 639.6356 681.4621 714.1296 762.8952 779.6802 869.4268 958.7736 980.8264 1035.8580 1062.9546 1085.5298 1111.9166 1138.9078 1222.6605 1232.7532 1263.0722 1267.2345 1279.5384 1283.9942 1362.9975 1443.6333 1448.0308 1454.6755 1460.9932 1665.8343 3004.3710 3034.3971 3043.4142 3054.9715 3068.5942 3110.4848 3115.9469 3158.1831 3515.9926
redmass: 5.4988 5.1960 3.3164 2.3390 3.0374 4.3531 5.2242 5.6261 6.4350 11.1078 4.3498 1.8033 5.2799 8.6858 1.3320 4.9446 5.2705 1.1947 1.2733 3.9413 1.4270 1.5151 3.1391 4.6560 1.9343 1.1970 1.2080 1.1527 1.2604 1.2936 1.1461 1.3657 1.2130 1.9402 1.0844 1.0895 1.1003 1.0941 8.3050 1.0608 1.0566 1.0591 1.0995 1.0565 1.1085 1.1070 1.1122 1.0641
irintensity: 0.5487 0.4917 0.5946 0.7232 1.5956 5.9569 13.4468 0.4305 1.3020 3.9917 21.0667 32.0876 37.5577 97.0888 133.8375 0.6618 11.7733 5.9473 16.7632 0.8429 0.4704 0.7570 250.1823 4.9471 52.2707 4.9484 0.8824 8.4919 8.4195 2.7171 0.0794 12.2535 2.6331 112.7236 28.8572 13.4564 9.5622 5.0571 200.6079 11.1164 11.7186 8.0099 1.4411 14.1385 15.2747 1.2009 12.2702 27.1339
temp: 298.150 k
press: 1.00000 atm
elementType: 17 16 8 8 6 6 6 6 6 1 1 1 1 1 1 1 1 1
symmnumber: 1
zpe: 357647.4 jmol-1
zpe.correction: 0.136221 hartree
zpe.thermalcorrener: 0.147685 hartree
zpe.thermalcorrenthalpy: 0.148629 hartree
zpe.thermalcorrgfe: 0.094291 hartree
zpe.sumelectzpe: -1203.780835 hartree
zpe.sumelectthermal: -1203.769371 hartree
zpe.sumelectthermalent: -1203.768426 hartree
zpe.sumelectthermalfe: -1203.822765 hartree
dipole: -2.4875 0.9619 0.3782
dipole: 2.6937
quadrupole: -69.2204 -76.0457 -67.0404
quadrupole: 4.4721 -0.3920 -1.7290
quadrupole: 1.5484 -5.2768 3.7284 4.4721 -0.3920 -1.7290
hfenergy: -1203.9170559 hartree
pointgroup: C01 [X(C5H9Cl1O2S1)]
dipole: -0.8920537 -0.570719 -0.0404972 debye
dipolederiv: -0.6304928 -0.3000332 0.068838 -0.4025133 -0.4416439 0.0619491 0.0306791 0.0093481 -0.2057082 -0.3854833 -0.1076118 0.0593724 -0.1182802 -0.0643102 0.0506299 0.1093184 0.051694 -0.2296191 -1.2180951 -0.4875706 -0.0802477 -0.4044291 -0.4872035 -0.0589902 -0.0954378 -0.0734843 -0.4382976 -0.7298923 0.08509 -0.0660123 -0.1320351 -0.9370867 0.0178685 -0.0559664 0.0571841 -0.3151762 0.3263795 -0.1222504 0.0115948 -0.2432472 0.0105023 -0.0115287 0.0338633 -0.0045625 0.1527985 -0.2258953 0.0676858 -0.0563787 0.4513055 -0.1489146 0.0779311 -0.0751914 0.029775 0.11692 0.2031055 0.0943939 0.0121857 0.1128058 0.0647003 0.0164576 -0.0619607 -0.0301296 0.0622461 0.6729483 0.3559868 -0.0235173 0.4308788 0.4794677 -0.0305157 -0.1062629 -0.0292049 0.133533 1.6310206 0.2071423 0.1959736 0.221529 1.2964827 -0.033087 0.2030862 -0.0426167 0.2363962 -0.0097384 0.029595 -0.0133721 0.0486443 -0.0214081 -0.0863798 -0.0093331 -0.0792427 -0.0215424 0.0051814 0.0226679 0.0154334 0.0225054 -0.0071895 0.0896757 0.0077684 0.0801837 -0.0336848 0.0985627 0.0297745 -0.0031145 -0.0405854 0.0521971 -0.082421 -0.0135754 -0.0790905 0.0119881 0.0841255 0.0050496 0.022146 -0.0648162 0.0712272 0.0608085 0.0458246 0.0777156 0.0113556 -0.0416976 0.0310454 -0.0797603 -0.0066409 0.0514422 0.0498033 -0.0266106 0.052935 0.0466832 0.0102189 0.0141172 0.0435815 -0.0162948 -0.0409626 -0.1009116 0.0623671 -0.0441557 0.0195453 -0.0027898 -0.031048 0.0286867 0.0133017 -0.0454883 -0.0940063 0.0381464 -0.0472522 0.0348107 -0.0521148 0.0152768 -0.1078932 -0.0086484 0.0056488 0.0354435 -0.0568117 0.0402076 0.028315 0.264657 0.090689 -0.0275159 0.13652 0.162539 0.0372731 -0.0299034 0.030696 0.3894368 unknown
polarizability: 125.9137649|17.0893338|85.3133983|4.9342774|-2.7315736|55.9305517 unknown
InChI: InChI=1S/C5H9ClO2S/c6-2-4-9-3-1-5(7)8/h7H,1-4H2
charge 0 multiplicity 1
18 atoms
Cl 4.563561 1.909971 -0.337807
S  1.19118 -1.053266 0.387394
O  -3.891232 -0.508664 -0.468382
O  -2.718931 1.497287 -0.421541
C  -0.231501 0.163048 0.081799
C  -1.523606 -0.648437 -0.085021
C  2.599692 0.183845 0.676081
C  3.16243 0.659143 -0.657734
C  -2.720834 0.250223 -0.335795
H  -0.300704 0.843489 0.946272
H  -0.023779 0.755684 -0.823112
H  -1.44398 -1.360428 -0.928755
H  -1.730266 -1.261177 0.812854
H  3.358874 -0.356531 1.263464
H  2.211325 1.019934 1.280302
H  3.621457 -0.154987 -1.235949
H  2.425537 1.202846 -1.266539
H  -4.663024 0.09882 -0.632428
