program: Gaussian 09
title: 000246189
version: EM64L-G09RevD.01
frameworkgroup: C1[X(C4H8ClNOS)]
method: RPBEPBE
basis: SDD
operation: Freq
keyword: #p
keyword: freq=noraman
keyword: PBEPBE/SDD
title: #p freq=noraman PBEPBE/SDD
converged: YES YES NO NO
title: Mulliken charges:
elementType: Cl S O N C C C C H H H H H H H H
charge: -0.071039 0.163191 -0.264463 -0.592648 -0.606922 -0.753338 -0.517772 0.293082 0.275198 0.325511 0.287958 0.256684 0.273176 0.268993 0.340718 0.321671
chargesum: 0.00000
title: Mulliken charges with hydrogens summed into heavy atoms:
elementType: Cl S O N C C C C
charge: -0.071039 0.163191 -0.264463 0.069742 -0.006213 -0.208696 0.024397 0.293082
polarizability: 1.13243890e+02 -1.19655349e+01 7.40060305e+01 -4.70310226e+00 1.25239040e+00 5.53558722e+01
1716.lowfreq: -14.9579 0.0010 0.0023 0.0024 5.8461 12.6135 30.5097 41.9605 75.0753
frequency: 30.4880 41.5294 75.0648 91.5509 166.9459 203.1994 244.1868 297.4752 399.4464 480.4646 510.3857 559.3622 629.6641 642.0094 675.4901 748.0921 760.7982 854.9890 877.4505 971.4572 1050.4757 1066.1017 1115.0068 1147.3740 1220.0880 1234.8695 1273.4565 1288.7838 1356.7019 1433.8009 1451.3792 1454.3588 1591.7701 1640.5803 3040.0058 3042.9632 3067.2861 3117.0221 3124.6548 3155.9530 3520.5761 3675.0936
redmass: 5.4396 5.7108 2.8827 3.0289 4.8407 5.4147 5.7543 6.7291 2.0332 1.5857 1.8578 2.3144 6.6355 1.9029 5.2964 5.5158 1.1444 3.8857 1.6565 1.4166 1.6034 4.5763 1.1018 1.1596 1.1794 1.1469 1.1656 1.1824 3.6605 1.1377 1.0935 1.0987 1.7255 2.4855 1.0593 1.0591 1.0560 1.1081 1.1065 1.1120 1.0450 1.1043
irintensity: 5.5923 6.2954 4.2795 10.8698 2.5508 16.4549 1.3020 0.8502 4.9460 47.1744 102.2286 60.4907 69.6392 138.7266 2.7904 9.9213 7.4323 0.0780 1.5065 1.5659 2.2050 3.4056 6.1406 20.0722 6.0679 3.8065 0.7360 14.3592 158.3338 24.3597 21.0920 5.1259 48.4425 283.9070 7.3541 14.6302 14.7638 2.3301 3.5013 8.8790 44.3875 28.2778
temp: 298.150 k
press: 1.00000 atm
elementType: 17 16 8 7 6 6 6 6 1 1 1 1 1 1 1 1
symmnumber: 1
zpe: 318974.4 jmol-1
zpe.correction: 0.121491 hartree
zpe.thermalcorrener: 0.131570 hartree
zpe.thermalcorrenthalpy: 0.132514 hartree
zpe.thermalcorrgfe: 0.083515 hartree
zpe.sumelectzpe: -1144.690353 hartree
zpe.sumelectthermal: -1144.680274 hartree
zpe.sumelectthermalent: -1144.679330 hartree
zpe.sumelectthermalfe: -1144.728328 hartree
dipole: -4.6001 2.6633 0.6737
dipole: 5.3580
quadrupole: -52.2835 -70.4101 -60.1139
quadrupole: 1.1417 0.8815 1.8926
quadrupole: 8.6523 -9.4743 0.8219 1.1417 0.8815 1.8926
hfenergy: -1144.8118435 hartree
pointgroup: C01 [X(C4H8Cl1N1O1S1)]
dipole: -1.5549805 -0.4925023 1.3353361 debye
dipolederiv: -0.5917495 -0.0364483 0.2758017 -0.0792257 -0.2046029 0.0686235 0.3763036 0.0419853 -0.424911 -0.3924195 0.0730801 0.1105035 0.1304126 -0.1660457 0.0331557 0.1292211 0.066585 -0.0841582 -0.7013972 0.0708181 0.1005899 0.0402589 -0.4083545 0.2053176 0.2001238 0.0663886 -0.8583609 -1.214951 -0.019829 0.222358 0.1567799 -0.5375304 -0.2389487 0.0981775 -0.1918692 -0.4147536 0.1967189 0.0455223 -0.137751 -0.0257998 0.0420676 0.0110841 -0.1179557 -0.0104379 0.0204772 0.0226337 0.1277854 -0.0365632 0.1492085 0.0648109 0.1017368 -0.1056462 0.0789863 -0.1106795 0.6266342 0.1080153 -0.3319815 0.0487179 0.1567469 -0.0606881 -0.3987324 -0.0798302 0.4822426 1.4416967 -0.2959917 -0.3685658 -0.5604035 0.3342429 -0.2567475 -0.3220445 -0.1587262 0.973267 0.0067111 -0.081765 0.0078011 -0.0254658 -0.0175307 -0.0570425 0.0236786 -0.0414765 0.0662104 0.0817291 0.0182476 0.0061559 0.058633 0.0843986 0.012155 0.0191088 0.0494614 0.0141121 0.0400605 0.0475585 -0.0031009 0.0197331 0.0093938 -0.0471137 -0.0149867 -0.1090438 0.009341 -0.037222 -0.0901854 0.0646546 -0.0327816 0.0530472 0.061071 0.0163952 0.0800196 0.011538 -0.0298689 0.0065516 0.0112714 0.0112416 0.0697562 0.0382955 -0.0510767 0.0714986 -0.0693949 0.0173482 -0.1149207 0.0166544 -0.0585974 -0.0544929 -0.0370345 0.0329601 -0.0239461 0.0145448 0.2463928 0.073524 0.0326566 0.0910335 0.2860346 0.0904041 0.0746401 0.0759941 0.2060243 0.2876828 0.068037 0.0295153 0.0762549 0.2880584 0.0757316 0.0398335 0.0844109 0.1645007 unknown
polarizability: 106.7682326|6.8297608|56.7647072|-18.0346238|-6.3669842|79.0728525 unknown
InChI: InChI=1S/C4H8ClNOS/c5-1-2-8-3-4(6)7/h1-3,6H2
charge 0 multiplicity 1
16 atoms
Cl 3.816815 0.216659 -1.927563
S  0.426728 -0.039077 1.087496
O  -1.223979 0.328225 -1.953944
N  -2.880784 0.332959 -0.32457
C  1.579044 0.593905 -0.288891
C  -0.845722 -1.01109 0.054274
C  2.627605 -0.463667 -0.607524
C  -1.659105 -0.072107 -0.831007
H  2.034631 1.510467 0.118403
H  0.957636 0.8452 -1.16353
H  -0.312039 -1.73464 -0.579473
H  -1.449182 -1.553074 0.800977
H  3.261559 -0.711015 0.255741
H  2.195807 -1.373396 -1.049796
H  -3.430012 1.000314 -0.866293
H  -3.213902 0.048339 0.5945
