program: Gaussian 09
title: 000246188
version: EM64L-G09RevD.01
frameworkgroup: C1[X(C11H20Cl2N2O2S2)]
method: RPBEPBE
basis: SDD
operation: Freq
keyword: #p
keyword: freq=noraman
keyword: PBEPBE/SDD
title: #p freq=noraman PBEPBE/SDD
converged: YES YES NO NO
title: Mulliken charges:
elementType: Cl Cl S S O O N N C C C C C C C C C C C H H H H H H H H H H H H H H H H H H H H
charge: -0.112149 -0.112456 0.226566 0.226503 -0.244324 -0.244415 -0.366584 -0.366954 -0.384849 -0.366378 -0.366228 0.281029 0.281373 -0.811308 -0.811194 -0.638539 -0.638537 -0.511152 -0.511214 0.253818 0.253401 0.253475 0.209254 0.209288 0.253472 0.311266 0.311275 0.259785 0.296210 0.259769 0.296067 0.288903 0.282715 0.288848 0.282882 0.287819 0.292340 0.287975 0.292250
chargesum: 0.00000
title: Mulliken charges with hydrogens summed into heavy atoms:
elementType: Cl Cl S S O O N N C C C C C C C C C C C
charge: -0.112149 -0.112456 0.226566 0.226503 -0.244324 -0.244415 -0.055319 -0.055679 0.122370 0.096351 0.096532 0.281029 0.281373 -0.255313 -0.255358 -0.066922 -0.066807 0.069008 0.069011
polarizability: 2.46163654e+02 3.20994308e-02 1.76818888e+02 1.63304129e+01 1.30364137e-02 1.67373359e+02
1716.lowfreq: -12.4044 -7.3192 -0.0023 -0.0019 0.0005 5.8531 21.4826 34.5234 35.1481
frequency: 19.8915 34.4170 35.1017 44.2142 53.1921 64.9356 65.2307 87.2622 97.0600 98.1016 107.1890 125.1764 126.0601 138.4711 147.7249 178.6056 198.9069 204.0711 208.5347 247.4695 254.9861 261.2986 265.8058 309.1159 309.8350 330.1040 371.4587 424.2646 502.3433 555.5600 573.4330 579.1564 595.6643 628.7201 657.9042 664.8661 678.0357 683.7522 712.3260 713.7340 747.2871 757.3214 766.5920 767.4118 811.1602 864.2714 867.1380 884.8989 892.3388 963.1604 965.9899 991.1082 993.1453 1065.9616 1066.3641 1080.0651 1088.8569 1107.8551 1112.6809 1119.7860 1153.6530 1164.7140 1222.4959 1223.3442 1231.9082 1239.3396 1241.6496 1257.5701 1263.6077 1264.9535 1274.3722 1275.5507 1280.9901 1281.4040 1303.9098 1339.6455 1369.7128 1373.5261 1433.9594 1434.5445 1447.3578 1448.8207 1452.3364 1453.8608 1456.9684 1457.9611 1461.1139 1499.5050 1500.0236 1621.6578 1621.8857 2998.1014 2999.0310 3014.8902 3029.2121 3029.5194 3051.8941 3052.1032 3057.9161 3068.5446 3073.7261 3074.2254 3085.5605 3111.6720 3111.8951 3123.1593 3123.4203 3167.9717 3168.6455 3460.3154 3461.5913
redmass: 7.2316 7.7963 13.7037 8.2004 9.4086 9.2852 9.3567 6.1403 5.1903 5.7449 3.7979 2.1633 2.2022 3.2929 4.9497 3.7591 5.5062 4.9235 4.9721 3.4295 6.7312 4.7468 2.8784 4.9789 4.9473 3.1752 2.5224 2.7265 3.4350 5.1734 8.0278 7.7235 4.6856 1.2033 1.2593 3.6025 3.9836 4.8337 1.7449 3.7263 4.6118 2.0166 1.2050 1.6811 3.3827 1.7508 2.4987 2.2534 3.1976 1.5173 1.4720 2.1967 2.2290 4.4484 4.4538 2.2465 2.0622 1.2682 1.1078 1.4663 1.3549 1.8346 1.1528 1.1519 1.1981 1.2562 1.2100 1.2163 1.1703 1.1675 1.6746 1.7456 1.3523 1.2975 1.0712 1.2416 1.3423 1.2651 1.1276 1.1258 1.1080 1.0902 1.0820 1.1638 1.1312 1.1079 1.1077 1.5847 1.5507 5.8285 6.1839 1.0619 1.0618 1.0610 1.0595 1.0594 1.0588 1.0587 1.1001 1.0997 1.0566 1.0568 1.1024 1.1047 1.1047 1.1067 1.1067 1.1125 1.1125 1.0799 1.0798
irintensity: 1.1875 0.8649 0.1838 10.6937 0.4763 1.3301 1.4304 2.2125 0.9621 1.0082 0.7141 1.2101 5.7007 7.2866 7.1990 3.6111 11.1578 10.5867 6.2209 3.8483 0.1272 17.3418 0.0938 0.3827 0.9153 0.8253 6.8231 1.8532 4.4980 18.4136 15.1338 183.2737 2.9602 125.4346 7.5224 24.4681 0.5540 3.2086 8.4921 0.3761 0.0194 4.2862 3.7597 5.0459 0.7546 5.0672 1.8137 0.6819 6.6831 1.2214 0.8355 1.6282 0.3927 8.2750 3.7614 0.4768 8.7291 0.5774 0.0090 38.3227 9.1422 34.0950 12.1683 0.3855 4.2362 10.6614 3.4152 2.1579 2.1371 0.0558 29.5434 68.1758 17.4609 2.6452 5.9285 33.4131 5.4031 3.2654 42.9280 16.1977 2.9744 7.1769 0.4751 82.4015 38.6338 3.5071 19.0428 22.3380 220.4248 154.5135 186.1186 2.6508 59.8646 18.4038 15.1939 14.7137 5.1852 2.8958 9.8331 21.5475 4.2061 7.8363 34.2399 2.9707 2.9879 1.5948 1.0729 0.9623 3.3116 163.4422 156.5067
temp: 298.150 k
press: 1.00000 atm
elementType: 17 17 16 16 8 8 7 7 6 6 6 6 6 6 6 6 6 6 6 1 1 1 1 1 1 1 1 1 1 1 1 1 1 1 1 1 1 1 1
symmnumber: 1
zpe: 810967.1 jmol-1
zpe.correction: 0.308881 hartree
zpe.thermalcorrener: 0.332365 hartree
zpe.thermalcorrenthalpy: 0.333309 hartree
zpe.thermalcorrgfe: 0.252698 hartree
zpe.sumelectzpe: -2405.876046 hartree
zpe.sumelectthermal: -2405.852562 hartree
zpe.sumelectthermalent: -2405.851617 hartree
zpe.sumelectthermalfe: -2405.932228 hartree
dipole: 0.0077 -4.5144 0.0002
dipole: 4.5144
quadrupole: -166.4709 -157.2241 -138.2374
quadrupole: -0.0179 -2.3414 0.0284
quadrupole: -12.4934 -3.2466 15.7400 -0.0179 -2.3414 0.0284
hfenergy: -2406.1849268 hartree
pointgroup: C01 [X(C11H20Cl2N2O2S2)]
dipole: -0.012736 -0.0083843 -1.7760312 debye
polarizability: 237.3739407|-29.6945217|176.1609946|-0.3766412|0.2466045|176.820966 unknown
InChI: InChI=1S/C11H20Cl2N2O2S2/c12-2-6-18-8-10(16)14-4-1-5-15-11(17)9-19-7-3-13/h14-15H,1-9H2
charge 0 multiplicity 1
39 atoms
Cl 0.593185 2.051339 -2.468951
Cl -0.642611 -2.078221 -2.43557
S  4.175054 -0.365258 -1.003616
S  -4.189775 0.364582 -0.929873
O  2.865354 -1.425614 2.015161
O  -2.824681 1.446178 2.053456
N  0.94838 -1.401277 0.69103
N  -0.930332 1.409846 0.697463
C  0.022098 0.00877 2.630521
C  -0.000295 -1.308303 1.822256
C  0.03615 1.320588 1.813939
C  2.314288 -1.527078 0.877728
C  -2.292728 1.539487 0.906314
C  3.103052 -1.820433 -0.406612
C  -3.103325 1.82266 -0.366534
C  2.859532 0.988161 -1.152226
C  -2.881399 -0.994589 -1.08842
C  2.056477 0.781401 -2.425106
C  -2.101895 -0.803834 -2.378293
H  -0.868489 0.002447 3.284603
H  0.919612 0.01947 3.275118
H  0.207929 -2.135922 2.527355
H  -1.009095 -1.472329 1.405389
H  1.038847 1.477731 1.379899
H  -0.157293 2.153528 2.517038
H  0.555563 -1.567967 -0.242413
H  -0.552571 1.568955 -0.243597
H  2.459569 -2.158697 -1.236021
H  3.849457 -2.600839 -0.18655
H  -2.474027 2.150885 -1.210729
H  -3.843541 2.607339 -0.140786
H  3.414278 1.939298 -1.16381
H  2.230131 0.951344 -0.250437
H  -3.439372 -1.943905 -1.079577
H  -2.235077 -0.950724 -0.19898
H  1.555163 -0.19494 -2.487611
H  2.624201 0.997422 -3.340512
H  -1.599375 0.170375 -2.460885
H  -2.687138 -1.028575 -3.280459
