program: Gaussian 09
title: 000246177
version: EM64L-G09RevD.01
frameworkgroup: C1[X(C4H6Cl2OS)]
method: RPBEPBE
basis: SDD
operation: Freq
keyword: #p
keyword: freq=noraman
keyword: PBEPBE/SDD
title: #p freq=noraman PBEPBE/SDD
converged: YES YES NO NO
title: Mulliken charges:
elementType: Cl Cl S O C C C C H H H H H H
charge: -0.050721 -0.082554 0.204234 -0.079099 -0.569490 -0.550705 -0.693846 0.078636 0.267417 0.306824 0.274884 0.276818 0.302733 0.314866
chargesum: 0.00000
title: Mulliken charges with hydrogens summed into heavy atoms:
elementType: Cl Cl S O C C C C
charge: -0.050721 -0.082554 0.204234 -0.079099 0.004752 0.000998 -0.076247 0.078636
polarizability: 1.24950442e+02 -4.40869848e+00 7.21117109e+01 1.10936712e+01 8.95388658e-01 5.48965171e+01
1716.lowfreq: -12.1283 -4.8184 -0.0024 -0.0020 -0.0017 4.8472 25.9272 31.2216 53.0230
frequency: 25.0090 30.7321 52.9497 94.6324 150.9983 180.7427 209.4607 275.4801 323.8208 389.5422 450.2884 643.6015 659.5099 702.7735 721.5315 787.4100 859.5183 935.0766 966.7830 1068.2334 1108.3980 1168.6985 1238.9678 1249.0489 1267.2402 1299.5732 1392.2449 1462.3350 1466.3514 1765.8506 3022.7691 3037.5637 3064.0641 3097.2601 3117.9146 3151.9435
redmass: 2.7240 7.9157 5.8929 4.0032 3.4970 7.8917 8.5290 8.2563 6.5043 16.6329 3.0119 8.7585 10.8162 5.1798 6.1940 1.1137 2.0232 4.6217 1.3333 4.2689 1.0408 1.0952 1.1521 1.2759 1.1864 1.2100 1.0763 1.0955 1.0944 11.2319 1.0612 1.0581 1.0562 1.0998 1.1084 1.1120
irintensity: 0.2275 0.8697 1.7668 1.8221 11.3504 7.7558 4.2888 6.0767 4.8572 20.0390 0.1837 37.3566 192.8889 6.8509 2.8994 7.4068 15.7039 119.3749 0.7283 5.1346 0.4071 2.0413 17.3111 4.7337 1.5526 5.1651 45.3797 4.8300 8.5181 197.6344 8.8539 5.4970 13.9250 1.6439 1.1175 11.9396
temp: 298.150 k
press: 1.00000 atm
elementType: 17 17 16 8 6 6 6 6 1 1 1 1 1 1
symmnumber: 1
zpe: 247856.2 jmol-1
zpe.correction: 0.094403 hartree
zpe.thermalcorrener: 0.104641 hartree
zpe.thermalcorrenthalpy: 0.105585 hartree
zpe.thermalcorrgfe: 0.054849 hartree
zpe.sumelectzpe: -1548.791416 hartree
zpe.sumelectthermal: -1548.781178 hartree
zpe.sumelectthermalent: -1548.780234 hartree
zpe.sumelectthermalfe: -1548.830970 hartree
dipole: 0.2010 2.3226 -1.6212
dipole: 2.8396
quadrupole: -79.7126 -71.2427 -69.6431
quadrupole: -0.5351 2.8998 0.6622
quadrupole: -6.1798 2.2901 3.8897 -0.5351 2.8998 0.6622
hfenergy: -1548.8858191 hartree
pointgroup: C01 [X(C4H6Cl2O1S1)]
dipole: 0.1490306 1.011306 -0.4507062 debye
dipolederiv: -0.5704262 0.1872977 0.0126869 0.2867284 -0.3271813 -0.0226066 0.056937 -0.0420881 -0.1666883 -1.0457035 -0.1740844 -0.3938503 -0.2437305 -0.2431449 -0.0489424 -0.4627339 -0.0521706 -0.3839712 -0.364465 0.0118331 -0.01153 -0.0046401 -0.0588821 0.1036444 -0.0590251 0.0657047 -0.0681473 -0.6096822 -0.0146168 -0.2439229 0.1299851 -0.5039849 0.3879481 -0.3832129 0.2287091 -0.6350766 0.1525599 -0.1762762 -0.0763431 -0.1742935 0.0962139 -0.0246425 -0.0962217 -0.0397742 0.0592789 0.6077248 -0.2913569 -0.0532663 -0.196437 0.3872833 0.0357851 0.0015319 0.0296467 0.2142556 0.221435 0.0614783 0.0956442 0.0577431 -0.1839594 0.0934234 0.1941374 0.1558711 0.0106727 1.5261674 0.2554983 0.6425685 0.2029086 0.7213544 -0.4078413 0.8067607 -0.2646282 0.8906841 0.0132628 0.0412316 -0.0279957 0.0365967 0.0297525 -0.0475027 -0.0296094 -0.0455588 -0.0905186 0.0329196 0.0060906 0.0390206 -0.0023899 -0.0532983 0.0351496 0.0400858 0.0333077 0.0630201 0.0191473 0.0410804 0.0338774 -0.0233025 -0.0741275 0.0493582 0.055423 0.0562748 0.0450937 0.0411088 0.0656581 0.0183499 0.0337462 0.0276832 -0.0552711 -0.0309847 -0.0525614 -0.0652282 0.0147597 -0.0495647 -0.0198105 -0.0786834 0.0911912 -0.0875244 -0.0434245 -0.0421316 -0.0156673 -0.0388084 0.0357309 -0.0154288 -0.0242313 0.0911001 -0.0109778 -0.0496637 -0.0306013 0.1422922 unknown
polarizability: 121.8739544|-7.9090474|71.5670218|16.9132495|2.8559773|58.5176936 unknown
InChI: InChI=1S/C4H6Cl2OS/c5-1-2-8-3-4(6)7/h1-3H2
charge 0 multiplicity 1
14 atoms
Cl 4.170383 -1.633736 -0.333663
Cl -3.385445 -1.126827 -1.234054
S  0.464496 0.894393 0.178362
O  -1.400493 -1.693004 0.579741
C  1.597897 -0.580821 -0.255947
C  3.030403 -0.182423 0.078884
C  -1.06622 0.377835 -0.770689
C  -1.745328 -0.87931 -0.261822
H  1.489551 -0.786381 -1.334159
H  1.268664 -1.451851 0.330548
H  3.389262 0.662115 -0.526818
H  3.179146 0.013917 1.151009
H  -0.831093 0.231095 -1.840708
H  -1.777421 1.218298 -0.706383
