program: Gaussian 09
title: 000246133
version: EM64L-G09RevD.01
frameworkgroup: C1[X(C16H15ClO2)]
method: RPBEPBE
basis: SDD
operation: Freq
keyword: #p
keyword: freq=noraman
keyword: PBEPBE/SDD
title: #p freq=noraman PBEPBE/SDD
converged: YES YES NO NO
title: Mulliken charges:
elementType: Cl O O C C C C C C C C C C C C C C C C H H H H H H H H H H H H H H H
charge: -0.059239 -0.296805 -0.261829 0.172523 -0.229191 -0.370368 0.394220 0.523078 -0.706462 -0.378610 -0.376670 -0.461179 -0.372428 -0.209752 -0.206538 -0.219417 -0.236338 -0.108588 -0.238792 0.225927 0.229997 0.242869 0.241921 0.232519 0.230147 0.278391 0.271005 0.232346 0.255519 0.257539 0.255713 0.228522 0.229233 0.230735
chargesum: 0.00000
title: Mulliken charges with hydrogens summed into heavy atoms:
elementType: Cl O O C C C C C C C C C C C C C C C C
charge: -0.059239 -0.296805 -0.261829 0.172523 -0.003264 0.102498 0.394220 0.523078 -0.001875 -0.100219 -0.105665 -0.228833 -0.116909 0.047787 0.049175 0.009105 -0.007104 -0.108588 -0.008057
polarizability: 2.30029421e+02 1.34525379e+01 1.92308482e+02 -1.05553179e+01 9.03180167e+00 1.19935644e+02
1716.lowfreq: -2.8369 -0.0015 0.0012 0.0015 2.7958 15.2350 21.3787 32.3291 49.8460
frequency: 20.8315 32.0021 49.7976 73.3421 87.3731 126.2368 145.0220 190.8887 202.5726 222.4129 252.5019 266.3479 292.8383 300.1191 337.6283 367.5937 405.2288 410.1717 443.0981 470.1440 501.2923 529.9509 572.3399 587.7779 615.6142 623.0646 637.2374 669.5732 705.1669 727.5301 731.8147 766.4838 800.7580 809.0872 834.8073 838.4238 853.7723 855.2499 899.1078 921.7422 962.5722 968.1505 977.4812 979.1970 981.8504 991.1778 997.9587 1002.5021 1026.7933 1057.1106 1069.3467 1078.0891 1083.8563 1097.1868 1113.7519 1156.4625 1173.2316 1177.2570 1187.9057 1192.2629 1219.3922 1246.0751 1279.7331 1286.5823 1290.7774 1321.8165 1353.1816 1369.1235 1385.9498 1388.7510 1390.5467 1443.5585 1455.6688 1456.5201 1465.3094 1473.7740 1485.6751 1585.3183 1595.3840 1597.8099 1615.3962 2989.3524 3000.5830 3003.9912 3107.1786 3114.5458 3117.1832 3117.8279 3127.4002 3139.2096 3148.5621 3150.1880 3151.4107 3165.0131 3169.8387 3173.3568
redmass: 7.4094 3.8690 4.0781 5.3764 4.3476 4.3721 6.2493 3.8499 1.1696 2.5550 7.2598 4.3850 5.0392 5.0128 3.8237 5.0023 2.8265 2.9437 5.9816 4.9434 3.7697 3.1799 3.1553 3.8604 6.3350 7.0450 5.5303 6.7673 1.7636 3.7013 6.6423 1.9210 3.1162 4.1146 1.5294 1.2677 1.9809 1.5547 3.3498 1.4976 1.3643 6.8300 1.3973 1.4151 2.6694 5.1503 1.3927 4.0261 2.1440 2.1352 3.3567 1.7875 1.6522 1.7579 1.4982 3.1404 1.0558 1.1150 1.1178 1.4689 1.9265 3.9049 1.3334 1.2662 1.3673 1.2629 1.5135 6.1126 1.2449 3.6258 5.3085 2.1236 1.0982 1.0528 1.0939 2.2280 2.3465 7.9923 6.0210 6.3158 6.0945 1.0733 1.0774 1.0357 1.0998 1.1004 1.1011 1.0875 1.0864 1.0913 1.0886 1.0945 1.0900 1.1015 1.0962 1.0973
irintensity: 0.2749 0.2275 0.0832 0.1387 0.4998 3.9732 0.0878 1.3925 0.1048 3.2659 1.4165 0.8094 0.2077 1.3337 3.3352 1.1002 0.7158 0.0052 28.2809 7.5041 11.5914 21.5178 0.7406 24.1675 1.2732 0.2503 9.9295 7.6021 47.2447 6.1699 6.5192 58.9766 29.9063 17.9910 57.3771 2.3673 11.6876 13.2177 82.9403 0.9151 0.0155 115.3085 5.4245 3.8505 43.0596 3.7840 3.2695 31.5170 3.7988 5.3223 16.1322 43.1647 29.1604 8.5440 9.0287 121.8898 0.1146 4.3957 1.4239 16.7455 3.7861 87.2497 1.9423 0.7283 2.8325 1.2910 1.7542 1.5867 26.6645 7.3433 0.5958 12.2429 1.7458 13.8266 5.1403 55.1364 11.7534 2.4068 0.1491 22.7962 1.6864 22.9894 47.6378 14.7808 13.0205 17.1891 22.0673 11.1955 0.3953 14.4790 0.7163 29.8185 2.6153 21.6030 5.6172 1.0050
temp: 298.150 k
press: 1.00000 atm
elementType: 17 8 8 6 6 6 6 6 6 6 6 6 6 6 6 6 6 6 6 1 1 1 1 1 1 1 1 1 1 1 1 1 1 1
symmnumber: 1
zpe: 698817.0 jmol-1
zpe.correction: 0.266165 hartree
zpe.thermalcorrener: 0.282803 hartree
zpe.thermalcorrenthalpy: 0.283748 hartree
zpe.thermalcorrgfe: 0.220108 hartree
zpe.sumelectzpe: -1227.836268 hartree
zpe.sumelectthermal: -1227.819630 hartree
zpe.sumelectthermalent: -1227.818685 hartree
zpe.sumelectthermalfe: -1227.882324 hartree
dipole: 2.3392 0.3217 0.6969
dipole: 2.4619
quadrupole: -115.7176 -114.3878 -118.1277
quadrupole: -5.0153 1.5459 1.8727
quadrupole: 0.3601 1.6899 -2.0500 -5.0153 1.5459 1.8727
hfenergy: -1228.1024328 hartree
pointgroup: C01 [X(C16H15Cl1O2)]
dipole: -0.8917487 0.2784797 -0.2556641 debye
polarizability: 224.9800126|-17.892193|197.7625178|-13.2870149|-3.2809529|119.5310169 unknown
InChI: InChI=1S/C16H15ClO2/c1-16(13-7-9-14(17)10-8-13)18-11-15(19-16)12-5-3-2-4-6-12/h2-10,15H,11H2,1H3
charge 0 multiplicity 1
34 atoms
Cl 4.691844 -2.824033 -0.312323
O  -0.589888 1.308756 1.027661
O  0.304763 2.420014 -0.856224
C  0.684695 1.809543 0.432578
C  -1.65887 1.390239 -0.018142
C  -0.846777 1.622358 -1.319461
C  1.644756 0.630358 0.222223
C  -2.525988 0.148197 -0.016934
C  1.268581 2.905328 1.323387
C  1.643742 -0.467755 1.116318
C  2.587051 0.665589 -0.83396
C  -3.935195 0.275019 0.041567
C  -1.953653 -1.147381 -0.104867
C  2.570413 -1.523046 0.961739
C  3.516643 -0.384472 -1.006016
C  -4.764269 -0.869206 0.000437
C  -2.779299 -2.290881 -0.138976
C  3.493589 -1.462237 -0.100272
C  -4.187636 -2.15606 -0.090678
H  -2.273639 2.283835 0.204981
H  -0.51137 0.66088 -1.755365
H  -1.379683 2.220776 -2.072552
H  0.533227 3.718163 1.436815
H  1.510867 2.493192 2.316984
H  2.192573 3.309245 0.875224
H  0.904936 -0.499335 1.923511
H  2.580692 1.510698 -1.530237
H  -4.385868 1.272112 0.124163
H  -0.863623 -1.258003 -0.123482
H  2.571902 -2.372938 1.650423
H  4.24175 -0.364351 -1.824725
H  -5.853207 -0.75707 0.046197
H  -2.327546 -3.287247 -0.201612
H  -4.827215 -3.045387 -0.117282
