program: Gaussian 09
title: 000246131
version: EM64L-G09RevD.01
frameworkgroup: C1[X(C12H15ClO2)]
method: RPBEPBE
basis: SDD
operation: Freq
keyword: #p
keyword: freq=noraman
keyword: PBEPBE/SDD
title: #p freq=noraman PBEPBE/SDD
converged: YES YES NO NO
title: Mulliken charges:
elementType: Cl O O C C C C C C C C C C C C H H H H H H H H H H H H H H H
charge: -0.059254 -0.274578 -0.249937 0.168338 0.026734 -0.398473 -0.345833 0.362061 -0.719578 -0.719408 -0.369469 -0.364133 -0.213029 -0.215117 -0.109985 0.206932 0.201068 0.223185 0.229160 0.202871 0.227415 0.247852 0.227881 0.228625 0.205064 0.228494 0.271986 0.269798 0.255683 0.255648
chargesum: 0.00000
title: Mulliken charges with hydrogens summed into heavy atoms:
elementType: Cl O O C C C C C C C C C C C C
charge: -0.059254 -0.274578 -0.249937 0.168338 0.233666 0.025780 0.086198 0.362061 -0.016430 -0.057225 -0.097483 -0.094336 0.042653 0.040531 -0.109985
polarizability: 1.84635243e+02 4.89598534e+00 1.28642649e+02 -7.09655366e+00 1.08314471e+01 1.09015677e+02
1716.lowfreq: -12.8938 0.0012 0.0014 0.0020 4.4617 10.7471 51.9389 59.0367 88.3922
frequency: 51.8945 59.0044 88.3175 134.9383 165.6111 195.3407 199.3623 206.0486 238.6499 249.7637 277.2596 305.1160 335.1473 339.3983 404.6537 413.9642 430.4239 464.5095 471.4898 514.0158 530.9921 583.1826 623.0725 642.0511 719.1087 727.2815 783.0196 803.5511 838.0673 842.2762 846.8770 881.0191 904.7247 960.5031 969.6632 977.1535 986.6707 1001.1406 1033.0309 1067.6907 1071.3893 1078.4145 1088.3164 1114.1012 1127.0107 1161.3274 1171.1253 1176.2369 1210.4413 1232.6827 1248.2402 1285.0712 1308.2635 1328.8911 1358.9848 1367.1358 1369.4924 1384.4417 1386.9652 1388.6222 1436.4770 1454.1076 1458.7930 1459.1699 1468.5473 1470.7478 1477.8564 1585.2032 1595.4560 2948.0100 2961.9105 2989.8140 2994.8362 3009.7161 3062.7234 3084.1356 3089.5702 3096.8093 3116.5738 3121.3317 3144.7638 3145.9283 3168.4787 3171.9020
redmass: 4.8112 4.0461 3.5920 4.2948 4.2236 1.2625 1.0640 2.2325 2.9848 2.9065 5.0697 3.6890 3.4870 3.9017 3.8905 2.9935 3.9383 3.9166 4.2755 4.1235 2.7145 3.4927 6.9275 3.7123 5.7735 3.8528 2.6445 2.9747 1.5110 1.2821 2.0786 3.3119 3.2903 1.5264 1.3153 1.4993 1.3427 4.1848 3.3264 3.2969 2.0650 2.0056 1.6709 1.5606 2.7462 1.9202 2.1494 1.3237 1.3541 1.9546 1.9655 1.2459 1.2759 1.2441 1.4275 1.7958 3.0255 1.2351 3.4523 1.2915 1.0951 1.1017 1.0488 1.0481 1.0881 2.1830 1.0505 7.9996 6.3356 1.0834 1.0676 1.0380 1.0581 1.0346 1.1008 1.0982 1.0992 1.1002 1.1005 1.1010 1.0887 1.0886 1.0957 1.0968
irintensity: 0.5069 0.2937 0.0289 3.5108 0.6838 0.4793 0.0650 1.5998 0.1488 1.8367 2.7491 1.2860 3.5825 1.6115 0.7243 0.0657 10.2901 12.7679 23.1057 4.1788 9.4989 12.4513 1.4419 2.3210 6.5317 3.1010 12.7882 27.6558 54.8561 0.6057 8.6278 29.5928 77.8638 12.9456 3.8450 12.7902 0.7126 44.6424 14.8576 19.0187 86.1161 37.2564 29.0075 1.6086 77.4890 24.6177 52.3316 6.7937 7.8266 57.7486 25.7696 0.8664 2.3520 5.7418 4.2730 14.5093 1.1792 30.2730 12.2260 17.6127 7.8070 1.8309 11.8995 10.5805 6.2927 59.4939 7.9188 3.1029 20.4763 28.9651 53.4370 14.5581 45.2525 10.3287 23.7188 38.3575 29.5554 33.1188 12.5803 23.4503 1.2389 1.5752 6.2178 1.3280
temp: 298.150 k
press: 1.00000 atm
elementType: 17 8 8 6 6 6 6 6 6 6 6 6 6 6 6 1 1 1 1 1 1 1 1 1 1 1 1 1 1 1
symmnumber: 1
zpe: 637824.9 jmol-1
zpe.correction: 0.242935 hartree
zpe.thermalcorrener: 0.257293 hartree
zpe.thermalcorrenthalpy: 0.258237 hartree
zpe.thermalcorrgfe: 0.201926 hartree
zpe.sumelectzpe: -1075.644445 hartree
zpe.sumelectthermal: -1075.630087 hartree
zpe.sumelectthermalent: -1075.629142 hartree
zpe.sumelectthermalfe: -1075.685453 hartree
dipole: -1.6843 0.8792 -1.4391
dipole: 2.3835
quadrupole: -104.3027 -93.1571 -93.1145
quadrupole: -4.7917 5.2550 1.9459
quadrupole: -7.4446 3.7010 3.7436 -4.7917 5.2550 1.9459
hfenergy: -1075.8873794 hartree
pointgroup: C01 [X(C12H15Cl1O2)]
dipole: 0.7012541 -0.2746668 -0.5586911 debye
polarizability: 183.2922785|7.024167|130.6052196|11.3174791|-8.6164505|108.3960706 unknown
InChI: InChI=1S/C12H15ClO2/c1-9-7-8-14-12(2,15-9)10-3-5-11(13)6-4-10/h3-6,9H,7-8H2,1-2H3
charge 0 multiplicity 1
30 atoms
Cl -4.820328 -0.7681 -0.653745
O  1.87122 -0.475281 0.901623
O  1.584829 1.690003 -0.173218
C  1.010386 0.712105 0.768639
C  2.201518 -1.136576 -0.395152
C  2.845834 -0.099947 -1.33664
C  1.901278 1.103653 -1.495595
C  -0.421536 0.317814 0.353199
C  1.042498 1.397242 2.136867
C  3.115303 -2.308193 -0.038696
C  -1.248637 1.238399 -0.335216
C  -0.960318 -0.932512 0.743335
C  -2.588244 0.916139 -0.647993
C  -2.297546 -1.272239 0.440559
C  -3.090348 -0.338878 -0.254313
H  1.257349 -1.506022 -0.85308
H  3.041786 -0.558508 -2.32562
H  3.809587 0.232494 -0.908727
H  2.36606 1.92802 -2.059851
H  0.965241 0.795794 -2.008482
H  0.640489 0.720285 2.908238
H  2.085097 1.653993 2.383785
H  0.43596 2.317394 2.113462
H  2.605099 -3.005664 0.647863
H  3.407234 -2.862034 -0.949591
H  4.02952 -1.940907 0.459718
H  -0.836855 2.21078 -0.626491
H  -0.325304 -1.639449 1.288172
H  -3.226356 1.62575 -1.18257
H  -2.713212 -2.238752 0.739822
