program: Gaussian 09
title: 000246112
version: EM64L-G09RevD.01
frameworkgroup: C1[X(C10H11BrO2)]
method: RPBEPBE
basis: SDD
operation: Freq
keyword: #p
keyword: freq=noraman
keyword: PBEPBE/SDD
title: #p freq=noraman PBEPBE/SDD
converged: NO YES NO NO
title: Mulliken charges:
elementType: Br O O C C C C C C C C C C H H H H H H H H H H H
charge: 0.024843 -0.289332 -0.252730 -0.383726 -0.223176 0.227688 -0.677278 0.190921 -0.334170 -0.326979 -0.180721 -0.173960 -0.202296 0.215857 0.215855 0.224808 0.224810 0.213676 0.226703 0.213665 0.277201 0.276534 0.257137 0.254670
chargesum: 0.00000
title: Mulliken charges with hydrogens summed into heavy atoms:
elementType: Br O O C C C C C C C C C C
charge: 0.024843 -0.289332 -0.252730 0.047987 0.226443 0.227688 -0.023235 0.190921 -0.056969 -0.050445 0.076416 0.080710 -0.202296
polarizability: 2.21656338e+02 7.80332768e+00 1.21537625e+02 -5.18534269e-03 6.12446139e-03 6.28316773e+01
1716.lowfreq: -0.0006 0.0007 0.0007 2.4047 4.4362 13.7996 34.7043 55.4439 59.3000
frequency: 34.5924 55.2144 59.2969 73.4567 82.1525 161.0396 163.8697 197.9498 229.2758 257.8959 269.3924 312.8160 340.9449 408.7407 453.2186 475.5656 513.3605 621.0340 671.0807 683.4413 741.1877 758.0262 799.0369 843.3227 854.7903 878.8926 887.7025 940.6841 982.2033 992.9288 995.6398 1049.9850 1056.6369 1066.8017 1110.3807 1136.0888 1144.0498 1181.1426 1228.6498 1243.8073 1278.2260 1291.9912 1307.5035 1372.6961 1374.2767 1392.7745 1399.1395 1467.6093 1471.4608 1478.6795 1482.3545 1490.7616 1572.1148 1594.5074 1619.7191 2980.8918 2997.6425 3004.5194 3043.2111 3066.3968 3084.8668 3085.6444 3155.7010 3163.1604 3175.4085 3183.4388
redmass: 4.1826 1.7975 4.9896 5.0451 4.5146 5.4316 3.5617 8.4241 1.1033 5.5625 6.4590 5.1652 4.2684 2.8926 6.2943 3.4699 5.7301 7.1252 4.7573 7.6316 3.6663 1.0845 8.6567 1.2593 1.5884 1.1545 2.5550 2.9915 1.3539 1.3658 5.4080 3.1536 3.4012 3.1835 1.3900 2.1953 1.4755 1.1239 1.2557 3.3955 1.0981 1.2461 1.3917 5.6108 1.5482 3.8610 1.2120 2.3196 1.0901 1.0610 1.0410 1.0868 8.3393 6.1886 11.2508 1.0361 1.0600 1.0573 1.1017 1.1045 1.0991 1.1048 1.0889 1.0889 1.0969 1.0973
irintensity: 0.0101 0.0199 0.2150 0.5779 0.9415 2.0859 3.3905 1.1195 0.0183 0.2846 4.1645 12.7577 7.9466 0.0006 16.4626 12.8669 2.4678 1.9869 24.3004 8.3880 23.8266 3.7166 9.0992 2.4643 48.4901 1.6013 9.4573 23.1440 1.2047 0.3998 141.3438 65.2371 8.6161 286.9388 7.9085 3.3358 0.4657 46.9085 0.4963 365.3570 0.0012 0.1262 14.0510 5.5581 3.4820 20.3750 11.0458 43.1141 5.0171 1.2586 13.3596 17.1118 14.1756 103.3790 206.4236 34.7180 1.4415 43.4955 0.2270 0.0341 39.0216 92.7575 0.0443 1.0314 4.1231 1.8155
temp: 298.150 k
press: 1.00000 atm
elementType: 35 8 8 6 6 6 6 6 6 6 6 6 6 1 1 1 1 1 1 1 1 1 1 1
symmnumber: 1
zpe: 487424.4 jmol-1
zpe.correction: 0.185650 hartree
zpe.thermalcorrener: 0.198973 hartree
zpe.thermalcorrenthalpy: 0.199917 hartree
zpe.thermalcorrgfe: 0.143130 hartree
zpe.sumelectzpe: -550.618113 hartree
zpe.sumelectthermal: -550.604791 hartree
zpe.sumelectthermalent: -550.603847 hartree
zpe.sumelectthermalfe: -550.660634 hartree
dipole: 1.8275 -1.7340 0.0000
dipole: 2.5192
quadrupole: -76.9188 -85.9169 -87.8803
quadrupole: -8.2422 -0.0002 0.0009
quadrupole: 6.6532 -2.3449 -4.3083 -8.2422 -0.0002 0.0009
hfenergy: -550.8037635 hartree
pointgroup: C01 [X(C10H11Br1O2)]
dipole: -0.7640666 -0.6313039 0.0002827 debye
dipolederiv: -0.795571 0.2005201 -0.0007379 0.2191106 -0.1193036 0.0002575 -0.0007544 0.0002437 -0.0288469 -1.837853 -0.3478628 -0.000657 -0.7177325 -0.6660645 0.0000331 -0.0002157 0.0002658 -0.2743925 -0.8532893 0.2336897 -0.0006588 0.0536736 -0.9491299 0.00082 -0.0004333 0.0010896 -0.3209893 -0.0567968 -0.027487 -0.0001329 0.0276363 0.0591786 0.0001193 -0.0002253 0.0000699 0.1468713 1.0790975 0.1232765 0.0003717 0.0465943 0.2275542 0.0002355 0.0005076 0.0002866 0.3603051 -0.7285499 0.1462647 -0.0006682 0.1422521 -0.1240784 0.0002407 -0.0006231 0.0002489 -0.0097496 -0.0303945 -0.0032861 -0.0001157 -0.0994995 0.0383698 0.0000141 0.0000366 0.0001041 0.0988129 2.2687656 -0.100824 0.0014887 0.4383124 1.3027498 -0.001084 0.0007233 -0.001569 0.2316074 0.208448 -0.1612046 0.0004042 0.1894698 0.0191443 -0.0000496 -0.0000573 -0.0002747 -0.1037665 0.1650576 0.0504404 0.0000796 -0.2544891 0.0466537 -0.0003632 0.0005273 -0.000186 -0.1034053 -0.4080282 0.3039161 -0.0006184 0.2794894 -0.135876 0.0002181 -0.000582 0.0002246 -0.0983984 -0.6097858 -0.020661 -0.0002782 0.0067697 0.0508656 -0.0002076 -0.0003093 -0.0002193 -0.0977178 1.385121 -0.3540197 0.0013798 -0.3750464 0.2310513 -0.0007098 0.0014075 -0.0006945 -0.1166624 0.0416516 0.0445012 0.0587847 0.0112679 -0.0019983 -0.0939122 0.0591921 -0.1130306 -0.0679479 0.0418628 0.0441064 -0.0587093 0.0109113 -0.0014279 0.0937535 -0.0590065 0.1129405 -0.0687605 -0.081006 -0.0149245 -0.011922 0.0476948 0.0078323 0.0811188 -0.0390209 0.0879702 -0.0619793 -0.0811053 -0.0147419 0.0119611 0.0479277 0.0073777 -0.0812336 0.0388714 -0.0881882 -0.0614452 0.0538913 0.0270691 -0.0258478 0.0823573 0.02139 0.1186991 -0.074035 0.1138617 -0.0826004 -0.0614122 -0.1106453 0.0000294 -0.1564152 -0.0878529 0.0001802 0.0000932 0.0002126 0.1056065 0.0537376 0.0273621 0.0260007 0.0828212 0.0206227 -0.118897 0.074007 -0.1141527 -0.0816624 0.1092102 0.0518792 -0.000097 0.0108123 0.0061685 0.0002187 -0.0000397 0.0002473 0.1579093 0.0590459 -0.0653447 0.0000443 -0.07044 0.0472392 0.0001045 0.0000521 0.0001081 0.1539784 0.0016694 -0.0730284 0.0000078 -0.0694244 0.0383941 0.0001353 0.0000025 0.0001361 0.1626027 0.0762333 0.0410046 -0.0001088 0.0459465 -0.03886 0.0003089 -0.0001181 0.0003054 0.1606309 unknown
polarizability: 220.1181742|-14.5778683|123.0755861|0.1206186|-0.0920362|62.83188 unknown
InChI: InChI=1S/C10H11BrO2/c1-2-7-13-10(12)8-3-5-9(11)6-4-8/h3-6H,2,7H2,1H3
charge 0 multiplicity 1
24 atoms
Br 5.156123 -0.979363 0.004348
O  -1.744121 -0.200398 -0.000952
O  -1.182141 2.062777 -0.003755
C  -4.002395 -1.103852 -0.001659
C  -3.185444 0.188788 -0.002681
C  0.583154 0.376987 -0.000181
C  -5.518262 -0.806588 -0.003538
C  -0.830039 0.85669 -0.001713
C  1.615654 1.349476 -0.000951
C  0.916052 -1.001745 0.001941
C  2.969294 0.957239 0.000369
C  2.266964 -1.407562 0.003283
C  3.276671 -0.420826 0.002473
H  -3.730975 -1.704741 -0.889865
H  -3.732691 -1.702261 0.888742
H  -3.380824 0.806916 -0.898812
H  -3.38234 0.809286 0.891476
H  -5.814697 -0.227863 -0.898307
H  -6.09992 -1.745168 -0.002517
H  -5.816334 -0.224913 0.888774
H  1.341847 2.409428 -0.002602
H  0.116748 -1.747549 0.002528
H  3.766645 1.705398 -0.00023
H  2.528732 -2.469354 0.004929
