program: Gaussian 09
title: 000246100
version: EM64L-G09RevD.01
frameworkgroup: C1[X(C14H18O3)]
method: RPBEPBE
basis: SDD
operation: Freq
keyword: #pfreq=noraman
keyword: PBEPBE/SDD
title: #p freq=noraman PBEPBE/SDD
converged: YES YES NO NO
title: Mulliken charges:
elementType: O O O C C C C C C C C C C C C C C H H H H H H H H H H H H H H H H H H
charge: -0.286270 -0.248252 -0.214493 -0.364013 -0.352234 -0.376094 -0.354686 -0.315074 -0.694053 0.183937 0.138476 0.223983 -0.333007 -0.332275 -0.218932 -0.221624 -0.215495 0.189976 0.198095 0.194258 0.191136 0.233853 0.207686 0.195290 0.196772 0.229073 0.236085 0.217144 0.210611 0.211283 0.277073 0.279471 0.240869 0.240298 0.231134
chargesum: 0.00000
title: Mulliken charges with hydrogens summed into heavy atoms:
elementType: O O O C C C C C C C C C C C C C C
charge: -0.286270 -0.248252 -0.214493 0.024058 0.033161 0.065445 0.037376 0.150083 -0.055015 0.183937 0.138476 0.223983 -0.055934 -0.052804 0.021938 0.018674 0.015639
polarizability: 2.22656805e+02 -4.21778826e+00 1.69525745e+02 -1.72890909e+01 4.84047034e+00 1.01332411e+02
1716.lowfreq: -10.1054 0.0004 0.0006 0.0009 4.5871 10.2214 14.6193 26.4150 32.2956
frequency: 12.9845 26.1433 32.0022 43.3066 68.7219 82.9558 102.4651 112.8920 119.4686 131.0398 183.2125 198.6101 233.0123 236.5096 252.0010 269.7822 313.7726 358.6442 398.4637 416.7032 439.0554 464.7312 489.6653 539.1892 629.1076 672.7667 678.5185 726.4171 745.8933 750.1094 762.8641 794.3972 803.6632 824.2329 882.1326 890.3584 900.8586 914.9261 976.0441 990.0874 1002.4314 1008.4791 1017.6274 1025.4341 1041.3298 1063.2936 1065.2784 1080.7348 1095.0382 1121.4366 1166.0423 1175.5516 1201.0632 1203.5467 1234.3604 1236.6168 1255.3463 1270.1467 1282.3207 1292.7679 1293.8537 1297.5208 1340.1392 1354.4770 1359.9849 1369.4362 1390.5910 1400.3158 1430.1883 1450.7913 1464.6110 1465.5769 1470.7082 1473.4494 1477.9995 1482.0553 1488.5043 1561.7279 1580.7502 1604.5683 1618.0256 2955.7456 2960.0471 2969.4249 2973.0896 2989.5150 2993.5957 3009.5389 3020.8138 3026.0028 3032.8372 3054.5477 3069.5677 3072.8256 3106.6991 3136.0914 3148.0316 3160.2758 3172.5184
redmass: 3.9842 4.9584 2.4432 2.9001 3.7623 3.4136 3.9565 2.2847 2.9168 2.2523 3.5483 4.7394 1.4181 2.0887 4.5663 4.0721 5.1993 4.4167 8.7591 3.0974 3.6354 3.8558 4.0024 5.2833 6.3594 5.3983 4.9946 1.0699 1.2358 2.3789 2.4562 1.6094 1.4732 4.3685 2.6438 1.2670 3.2785 1.3753 1.7068 1.1592 1.4550 3.9508 1.3898 4.0622 3.1845 2.7641 2.8843 2.2343 2.1968 2.6495 1.7880 1.0663 2.2418 1.4672 3.0768 1.3298 1.2695 1.6525 1.0519 1.2080 1.1665 1.1509 1.4100 1.6327 1.7473 1.4901 1.2154 2.5977 2.2384 1.1099 1.0712 1.0762 2.3812 1.0817 1.0423 1.0805 1.0904 7.7129 6.1851 8.8437 6.4942 1.0587 1.0589 1.0591 1.0364 1.0641 1.0934 1.1012 1.0884 1.0578 1.1040 1.1035 1.1008 1.0993 1.1086 1.0860 1.0901 1.0948 1.1000
irintensity: 0.7457 0.4830 0.4644 0.5038 1.7257 8.8325 0.0505 0.9789 0.2413 0.1280 4.3770 2.9949 1.0543 2.0361 8.2449 0.6279 7.3310 1.9835 13.9706 1.7362 2.4447 1.5211 4.3103 0.9114 6.0953 15.8432 18.7811 11.8680 4.2163 32.2814 1.6560 38.8946 7.7425 16.6053 25.6662 1.9327 10.0468 0.6367 1.6237 0.8859 7.6037 0.9350 0.7981 106.6909 37.0655 55.7621 31.8403 0.2610 61.8376 7.7882 13.4939 4.5441 56.8432 4.8587 347.9273 8.5669 2.7773 11.2317 1.8418 2.8242 4.1629 0.7021 0.8428 1.0656 11.8161 1.1725 11.4718 26.2225 8.0340 14.6908 0.4271 0.6909 0.2954 1.8811 12.6548 3.7540 25.0702 24.0460 213.7109 50.6710 59.5530 0.8573 6.9131 91.8698 35.5433 23.6005 5.3038 0.6108 38.3372 42.6036 36.9893 32.9239 90.0135 54.0847 21.2077 2.5680 1.6853 7.3484 23.1386
temp: 298.150 k
press: 1.00000 atm
elementType: 8 8 8 6 6 6 6 6 6 6 6 6 6 6 6 6 6 1 1 1 1 1 1 1 1 1 1 1 1 1 1 1 1 1 1
symmnumber: 1
zpe: 756835.4 jmol-1
zpe.correction: 0.288263 hartree
zpe.thermalcorrener: 0.306311 hartree
zpe.thermalcorrenthalpy: 0.307255 hartree
zpe.thermalcorrgfe: 0.238433 hartree
zpe.sumelectzpe: -768.676111 hartree
zpe.sumelectthermal: -768.658064 hartree
zpe.sumelectthermalent: -768.657119 hartree
zpe.sumelectthermalfe: -768.725941 hartree
dipole: -0.6497 -1.9620 0.1632
dipole: 2.0732
quadrupole: -82.8369 -114.9825 -101.7139
quadrupole: -12.3928 -5.8069 -0.3302
quadrupole: 17.0075 -15.1381 -1.8695 -12.3928 -5.8069 -0.3302
hfenergy: -768.9643742 hartree
pointgroup: C01 [X(C14H18O3)]
dipole: -0.2100095 0.0780038 0.7842885 debye
polarizability: 225.0140097|-7.4840886|99.1190021|1.368229|-0.9111795|169.3819491 unknown
InChI: InChI=1S/C14H18O3/c1-2-3-4-7-10-17-14(16)13-9-6-5-8-12(13)11-15/h5-6,8-9,11H,2-4,7,10H2,1H3
charge 0 multiplicity 1
35 atoms
O  -0.167185 1.222992 -0.387165
O  0.20338 0.439035 1.772242
O  2.149185 0.314167 -3.560614
C  -3.961741 0.60202 0.106592
C  -4.887458 -0.617765 -0.102203
C  -2.481726 0.287658 -0.217087
C  -6.367328 -0.321256 0.231984
C  -1.589614 1.5190 -0.015919
C  -7.286722 -1.543331 0.020453
C  0.628652 0.659779 0.610283
C  2.04727 0.40523 0.180143
C  2.529903 0.309194 -1.166322
C  2.965816 0.263344 1.255004
C  3.920159 0.10119 -1.382699
C  4.339075 0.057742 1.019131
C  4.822146 -0.015747 -0.309386
C  1.666428 0.344385 -2.394326
H  -4.314175 1.440741 -0.529569
H  -4.044699 0.947374 1.157927
H  -4.531784 -1.459724 0.527169
H  -4.812276 -0.961932 -1.154784
H  -2.124749 -0.529446 0.437702
H  -2.395475 -0.062191 -1.264329
H  -6.721126 0.522266 -0.395564
H  -6.44105 0.021419 1.284275
H  -1.864666 2.344115 -0.693213
H  -1.610674 1.859833 1.034602
H  -8.337903 -1.306655 0.267434
H  -7.255613 -1.886013 -1.031163
H  -6.972264 -2.391013 0.658098
H  2.573636 0.320646 2.275145
H  4.257788 0.026495 -2.422331
H  5.027959 -0.043253 1.864487
H  5.889081 -0.171908 -0.501221
H  0.572549 0.384108 -2.232076
