program: Gaussian 09
title: 000246098
version: EM64L-G09RevD.01
frameworkgroup: C1[X(C14H18O4)]
method: RPBEPBE
basis: SDD
operation: Freq
keyword: #pfreq=noraman
keyword: PBEPBE/SDD
title: #p freq=noraman PBEPBE/SDD
converged: YES YES NO NO
title: Mulliken charges:
elementType: O O O O C C C C C C C C C C C C C C H H H H H H H H H H H H H H H H H H
charge: -0.285560 -0.274301 -0.244146 -0.229441 -0.385081 -0.346795 -0.245862 -0.239188 -0.687723 -0.273893 0.170011 0.237400 0.160385 -0.348644 -0.337093 -0.219042 -0.220387 -0.232519 0.202357 0.243048 0.187237 0.195317 0.187586 0.188740 0.192912 0.203597 0.208796 0.221209 0.213965 0.250403 0.220474 0.270908 0.278467 0.239774 0.238784 0.258307
chargesum: 0.00000
title: Mulliken charges with hydrogens summed into heavy atoms:
elementType: O O O O C C C C C C C C C C C C C C
charge: -0.285560 -0.274301 -0.244146 -0.229441 0.060324 0.035759 0.130464 0.157322 -0.043754 0.196983 0.170011 0.237400 0.160385 -0.077736 -0.058626 0.020732 0.018397 0.025788
polarizability: 2.15567575e+02 3.50851703e+00 1.84210462e+02 -1.08717344e+01 9.60937743e+00 1.01660231e+02
1716.lowfreq: -12.2382 -5.1645 -0.0009 -0.0007 -0.0006 3.0795 17.8530 21.4634 42.7309
frequency: 17.6844 21.0687 42.6614 56.9962 67.9293 84.2907 87.8429 113.9819 121.5879 126.1346 157.6265 181.0267 223.4434 234.5601 252.4071 256.5534 260.3011 275.8242 325.8673 361.6617 392.0563 433.8236 441.9114 471.6439 510.3583 534.1406 625.6894 671.2211 689.5974 747.8628 751.6067 783.7459 796.2711 811.0957 817.0909 823.6654 853.2208 902.9392 910.0385 940.2576 980.8885 983.2596 997.8772 1003.2251 1016.9171 1032.3737 1038.3286 1065.5270 1070.5715 1080.3207 1095.6791 1107.2071 1126.8280 1150.2162 1174.2709 1198.3002 1201.5256 1214.5564 1232.1457 1242.2996 1271.1056 1272.6627 1280.1750 1291.5550 1336.8844 1351.7631 1360.8959 1373.4982 1391.1394 1406.1068 1413.7082 1432.3681 1456.7571 1460.7225 1470.3232 1473.5011 1476.4785 1477.3191 1485.3581 1494.3910 1558.6406 1580.6124 1610.1210 1616.5418 2915.0586 2931.1717 2965.3300 2966.5300 2976.1304 2981.9021 2990.4191 3008.6198 3009.8811 3022.5788 3055.8947 3073.5659 3077.0292 3094.1013 3135.1760 3147.2246 3158.5098 3171.1988
redmass: 6.2994 4.7153 6.7822 2.4568 2.8927 3.0765 3.9394 4.7730 2.0090 3.3199 5.5806 3.3251 4.2160 1.1461 2.7481 5.6297 3.3428 3.3134 4.4904 4.7355 6.7940 2.8434 4.2741 3.5592 3.4000 4.0599 6.4235 5.4492 5.7452 1.0739 2.6458 2.2190 2.5300 1.3113 2.1386 4.1569 4.9283 1.7561 1.3555 1.1632 3.3498 1.4734 2.7105 1.5490 1.4649 3.0326 3.0219 3.5735 3.1878 2.2615 2.1224 2.5525 2.4289 1.4649 1.0675 2.1163 1.1761 1.3448 2.0909 1.4109 1.3053 1.5434 1.2039 1.0872 1.2821 1.4345 1.5229 3.7912 1.2184 1.5173 1.6463 2.1532 1.1073 1.0856 2.3549 1.0649 1.0563 1.0584 1.0678 1.0911 7.6978 5.8279 7.8528 8.1251 1.0548 1.0562 1.0616 1.1030 1.0362 1.1035 1.0595 1.0915 1.0999 1.0592 1.1045 1.1003 1.1004 1.1070 1.0859 1.0898 1.0948 1.1005
irintensity: 0.3954 0.5203 4.9851 1.2237 1.3335 0.3159 3.5066 1.1382 0.3305 3.6669 11.9213 9.7035 1.8932 0.1461 6.4284 1.2123 1.8724 8.0610 0.1521 5.5739 9.0211 3.6444 1.7845 8.2269 7.1019 0.2118 10.2274 29.0580 12.6167 9.6900 28.2094 39.1082 23.5726 3.6822 10.9882 14.9719 12.5090 12.3016 1.7564 1.1788 45.0392 2.9418 12.9999 5.7022 2.1733 63.2170 19.9880 118.3085 80.3585 6.7004 43.7810 50.6075 2.9064 3.4416 7.6731 40.7552 14.2535 1.5195 228.2584 135.8365 2.9328 13.0874 0.0318 0.2481 10.9035 6.9623 16.4876 6.1415 9.5456 1.2094 11.8539 5.7638 18.0557 7.0746 0.8014 0.3607 6.2570 8.6406 3.5897 13.6558 68.7461 134.1667 55.2543 133.7747 45.4750 95.1655 38.9955 60.9888 31.6364 34.9795 33.8238 1.4288 11.8841 35.9921 20.8525 71.6005 69.1702 17.3942 2.2139 1.7449 7.7736 25.3966
temp: 298.150 k
press: 1.00000 atm
elementType: 8 8 8 8 6 6 6 6 6 6 6 6 6 6 6 6 6 6 1 1 1 1 1 1 1 1 1 1 1 1 1 1 1 1 1 1
symmnumber: 1
zpe: 766883.8 jmol-1
zpe.correction: 0.292091 hartree
zpe.thermalcorrener: 0.311079 hartree
zpe.thermalcorrenthalpy: 0.312023 hartree
zpe.thermalcorrgfe: 0.241856 hartree
zpe.sumelectzpe: -843.798686 hartree
zpe.sumelectthermal: -843.779697 hartree
zpe.sumelectthermalent: -843.778753 hartree
zpe.sumelectthermalfe: -843.848921 hartree
dipole: -0.0553 1.3206 -1.5162
dipole: 2.0114
quadrupole: -88.4549 -103.7102 -110.6509
quadrupole: 14.6584 0.6325 -7.0426
quadrupole: 12.4838 -2.7715 -9.7123 14.6584 0.6325 -7.0426
hfenergy: -844.0907764 hartree
pointgroup: C01 [X(C14H18O4)]
dipole: -0.0478789 0.5263132 0.5890165 debye
polarizability: 216.4346591|-0.0846563|183.5551638|-6.4634054|-11.6523109|101.4484453 unknown
InChI: InChI=1S/C14H18O4/c1-2-3-8-17-9-10-18-14(16)13-7-5-4-6-12(13)11-15/h4-7,11H,2-3,8-10H2,1H3
charge 0 multiplicity 1
36 atoms
O  -2.503554 1.291586 0.02918
O  0.215686 1.77456 0.631205
O  1.764447 2.661534 -0.866508
O  -0.444375 -2.159037 0.786892
C  -3.947995 -0.637998 -0.300078
C  -5.237957 -1.383588 0.115507
C  -3.724642 0.630876 0.526807
C  -2.088444 2.42293 0.856871
C  -5.468584 -2.663552 -0.71632
C  -0.732183 2.887374 0.349953
C  2.140608 0.447356 0.10021
C  1.536733 -0.812723 0.412969
C  1.385822 1.723907 -0.123136
C  3.551057 0.53856 -0.020754
C  2.377673 -1.93655 0.63575
C  4.367778 -0.587823 0.204689
C  3.778459 -1.829557 0.545641
C  0.053373 -1.052325 0.429591
H  -4.00145 -0.363109 -1.371493
H  -3.074097 -1.305897 -0.174934
H  -6.110906 -0.707578 0.004904
H  -5.179614 -1.649592 1.190627
H  -4.588796 1.326858 0.432382
H  -3.598201 0.37739 1.603412
H  -2.815458 3.262511 0.778498
H  -2.016732 2.120321 1.924302
H  -5.559601 -2.425098 -1.792725
H  -4.62355 -3.366911 -0.598463
H  -6.391784 -3.185983 -0.405361
H  -0.744856 3.084665 -0.735869
H  -0.388142 3.792882 0.881425
H  3.988872 1.505353 -0.289029
H  1.890676 -2.890864 0.865097
H  5.45581 -0.499279 0.116279
H  4.409634 -2.706657 0.724661
H  -0.603007 -0.224644 0.09532
