program: Gaussian 09
title: 000246093
version: EM64L-G09RevD.01
frameworkgroup: C1[X(C13H11ClO2)]
method: RPBEPBE
basis: SDD
operation: Freq
keyword: #p
keyword: freq=noraman
keyword: PBEPBE/SDD
title: #p freq=noraman PBEPBE/SDD
converged: YES YES NO NO
title: Mulliken charges:
elementType: Cl O O C C C C C C C C C C C C C H H H H H H H H H H H
charge: -0.055577 -0.286751 -0.256395 0.217858 0.402713 0.121815 -0.364084 -0.433651 -0.362525 -0.434425 -0.242779 0.175073 -0.249914 -0.245763 -0.183379 -0.591564 0.301501 0.242332 0.272594 0.238192 0.236001 0.233265 0.230899 0.238313 0.255650 0.262365 0.278237
chargesum: 0.00000
title: Mulliken charges with hydrogens summed into heavy atoms:
elementType: Cl O O C C C C C C C C C C C C C
charge: -0.055577 -0.286751 -0.256395 0.217858 0.402713 0.121815 -0.062583 -0.191319 -0.089931 -0.196233 -0.006778 0.175073 -0.016650 -0.014864 0.310584 -0.050963
polarizability: 1.95826736e+02 2.49777729e+00 2.05140503e+02 2.23770116e+00 -2.15693747e+00 7.34909817e+01
1716.lowfreq: -3.9167 0.0012 0.0015 0.0030 5.8319 11.1793 29.4457 44.9554 48.8586
frequency: 29.2416 44.9064 48.7497 79.0154 127.2829 142.6134 180.9257 228.2172 247.5009 265.3737 319.1046 350.8108 405.0279 418.9853 457.5414 472.9321 512.3831 524.5573 551.5522 608.3344 625.6116 648.5171 716.0594 753.6319 758.0402 787.8825 789.7616 808.8282 830.6994 863.0679 893.7313 939.2509 951.3849 976.5327 979.5591 998.6348 1000.0337 1007.5151 1030.2880 1067.5447 1080.6284 1118.1891 1153.6436 1171.2204 1178.8331 1194.5872 1217.5026 1234.4745 1238.2564 1285.6738 1299.4536 1360.1045 1372.0037 1402.8778 1408.9407 1439.5887 1440.3832 1451.0169 1455.8019 1517.9866 1576.4163 1589.5365 1602.7695 1630.2167 2999.8176 3064.1814 3077.7034 3122.8015 3126.6102 3138.4875 3149.1888 3150.0857 3159.9372 3168.5101 3202.3401
redmass: 6.4016 8.0759 8.9062 4.6718 5.3479 4.7878 4.0890 3.8215 6.1243 2.8400 4.1316 7.3473 3.5284 3.6467 4.3457 3.2973 4.1045 6.5010 5.3994 4.6377 3.5691 6.6157 3.2657 5.0487 1.6438 5.4174 1.8505 2.8139 1.6331 5.0021 1.6621 2.1834 1.3906 1.7945 2.0268 2.0302 1.6067 1.3354 2.6091 2.2819 2.4777 2.6561 1.3651 1.1667 1.1143 1.3429 1.1914 1.9472 2.0726 1.6223 1.3191 1.5040 2.3525 3.0552 5.8198 1.1128 2.2892 1.6512 1.3355 3.8574 7.4560 6.5284 7.7413 6.5421 1.0606 1.0634 1.0965 1.0869 1.0877 1.0910 1.1101 1.0916 1.0986 1.0981 1.0936
irintensity: 0.2853 3.1628 3.4558 1.0896 0.9934 4.7952 1.8242 0.1779 2.4403 5.9393 2.6445 9.1317 0.8213 10.3178 7.6373 0.0350 15.6852 2.8709 5.7865 19.2170 0.8779 6.9824 2.0232 4.6891 2.2653 0.0481 89.0753 4.8824 51.0366 8.8434 3.1002 12.7131 0.0803 11.3065 19.8936 29.1137 20.5481 0.4491 30.0224 82.0901 70.9179 122.1350 14.2369 1.0010 11.2654 54.4921 1.4164 152.8335 39.7606 32.7456 29.6295 7.1312 6.8846 6.2757 7.1887 12.1034 3.0894 11.8962 12.7112 21.8182 128.7708 13.3272 135.7607 8.7057 20.0100 14.1996 16.3540 0.7816 4.5406 20.4365 9.4716 12.2678 29.9190 16.0986 10.9342
temp: 298.150 k
press: 1.00000 atm
elementType: 17 8 8 6 6 6 6 6 6 6 6 6 6 6 6 6 1 1 1 1 1 1 1 1 1 1 1
symmnumber: 1
zpe: 539643.8 jmol-1
zpe.correction: 0.205539 hartree
zpe.thermalcorrener: 0.219342 hartree
zpe.thermalcorrenthalpy: 0.220286 hartree
zpe.thermalcorrgfe: 0.162959 hartree
zpe.sumelectzpe: -1111.374149 hartree
zpe.sumelectthermal: -1111.360347 hartree
zpe.sumelectthermalent: -1111.359403 hartree
zpe.sumelectthermalfe: -1111.416730 hartree
dipole: 0.4651 0.2587 1.7064
dipole: 1.7874
quadrupole: -79.2912 -99.7456 -102.7562
quadrupole: 5.2463 -4.8596 -2.4417
quadrupole: 14.6398 -5.8146 -8.8252 5.2463 -4.8596 -2.4417
hfenergy: -1111.5796888 hartree
pointgroup: C01 [X(C13H11Cl1O2)]
dipole: -0.1080384 -0.0068821 0.6948541 debye
polarizability: 195.2944425|4.2302504|202.6547624|-19.1750335|-3.8602273|76.5090159 unknown
InChI: InChI=1S/C13H11ClO2/c14-8-9-16-13(15)12-7-3-5-10-4-1-2-6-11(10)12/h1-7H,8-9H2
charge 0 multiplicity 1
27 atoms
Cl 3.427537 -2.741072 -0.761364
O  2.081422 0.064689 -0.063657
O  2.039755 2.228773 -0.891125
C  -0.878614 0.047687 0.072743
C  -2.293976 0.251544 0.348088
C  -0.058762 1.228141 -0.142664
C  -0.403322 -1.306985 0.000244
C  -2.835751 1.576703 0.39721
C  -0.644397 2.50893 -0.106572
C  -3.151013 -0.879559 0.559922
C  -2.026911 2.690263 0.166628
C  1.410816 1.246277 -0.419665
C  -1.267973 -2.386442 0.203232
C  -2.651799 -2.179539 0.492285
C  3.5339 0.047541 -0.353597
C  4.089573 -1.251918 0.192739
H  0.65008 -1.492176 -0.21126
H  -3.903924 1.700451 0.612788
H  0.00035 3.373549 -0.293755
H  -4.212136 -0.699692 0.770334
H  -2.445773 3.701105 0.197067
H  -0.875505 -3.407324 0.13855
H  -3.312547 -3.038313 0.65245
H  4.015029 0.908573 0.150869
H  3.694406 0.152286 -1.440866
H  5.183167 -1.290807 0.076287
H  3.799267 -1.417087 1.240188
