program: Gaussian 09
title: 000246075
version: EM64L-G09RevD.01
frameworkgroup: C1[X(C11H10O3)]
method: RPBEPBE
basis: SDD
operation: Freq
keyword: #pfreq=noraman
keyword: PBEPBE/SDD
title: #p freq=noraman PBEPBE/SDD
converged: YES YES NO NO
title: Mulliken charges:
elementType: O O O C C C C C C C C C C C H H H H H H H H H H
charge: -0.296234 -0.251351 -0.214058 0.127998 0.229514 -0.328968 -0.331390 0.200372 -0.218689 -0.220813 -0.331742 -0.225326 -0.051931 -0.544518 0.277901 0.280481 0.241470 0.240758 0.236750 0.245217 0.247866 0.237326 0.226807 0.222560
chargesum: 0.00000
title: Mulliken charges with hydrogens summed into heavy atoms:
elementType: O O O C C C C C C C C C C C
charge: -0.296234 -0.251351 -0.214058 0.127998 0.229514 -0.051067 -0.050909 0.200372 0.022781 0.019945 0.150224 0.022541 0.185396 -0.095150
polarizability: 1.86707829e+02 -1.38474217e+01 1.42760224e+02 1.21405160e+01 1.79450930e-01 6.39828881e+01
1716.lowfreq: -1.3585 -0.0011 -0.0006 0.0005 7.7150 8.5165 18.4568 38.3546 57.8177
frequency: 18.0748 38.3533 57.7962 75.4913 106.1526 133.7766 148.2928 229.9620 241.7748 263.7360 272.3349 340.4111 399.5890 425.5313 437.3387 476.7197 518.0260 621.6039 639.4311 675.6527 679.8956 748.7077 793.4287 795.0259 828.2213 870.7344 916.2080 929.0880 964.9522 975.7311 981.6466 1005.3332 1008.5255 1018.9383 1028.1951 1064.5412 1093.6221 1149.9768 1175.4903 1199.1875 1209.3894 1230.2603 1268.7430 1284.4668 1331.8055 1360.0415 1399.4128 1429.0828 1433.5895 1465.1604 1470.5998 1560.7294 1578.5706 1601.2465 1617.4862 1664.4542 3005.9985 3030.1009 3076.0471 3095.2828 3122.9997 3136.3366 3148.3941 3160.3142 3172.9105 3206.4775
redmass: 4.9584 4.0717 4.0244 3.1724 4.1465 3.1369 3.3194 5.8252 3.6024 5.2028 4.6093 3.8389 8.9338 2.6145 3.5746 3.6649 3.7637 3.8752 2.1008 5.3294 5.7706 2.6366 5.7544 1.6140 5.7700 3.7462 1.3345 1.5683 1.3634 1.7806 1.6647 1.4614 1.3048 1.3976 3.7961 2.8575 2.2069 1.6624 1.0648 2.2497 1.2556 3.0392 1.6394 1.2523 1.3818 1.8700 2.7478 2.0060 1.2718 1.1331 2.3080 7.8602 6.3818 9.5827 6.5383 4.7432 1.0581 1.0892 1.1053 1.0610 1.0952 1.0861 1.0901 1.0948 1.1000 1.1145
irintensity: 1.5680 0.7226 1.2582 3.2434 6.1351 1.6212 9.4275 3.4766 4.7502 1.4828 4.1518 16.1325 8.1163 1.3414 1.9597 3.4696 2.0621 4.4487 8.5678 21.4446 11.7433 31.9061 4.4387 40.2120 22.5960 39.3830 0.8544 53.0685 66.7037 23.5448 1.3974 7.4696 44.9634 1.2029 124.5882 72.2256 54.4138 0.9554 6.9876 66.2935 3.7755 368.6542 9.1838 2.4919 2.7386 15.4779 27.3072 8.2141 14.8536 10.6037 0.4731 22.4253 231.3190 60.6252 56.3816 3.5870 13.9016 30.0534 10.8305 8.8994 8.4377 2.6862 1.4180 7.0741 23.4713 20.5956
temp: 298.150 k
press: 1.00000 atm
elementType: 8 8 8 6 6 6 6 6 6 6 6 6 6 6 1 1 1 1 1 1 1 1 1 1
symmnumber: 1
zpe: 474961.7 jmol-1
zpe.correction: 0.180903 hartree
zpe.thermalcorrener: 0.194283 hartree
zpe.thermalcorrenthalpy: 0.195227 hartree
zpe.thermalcorrgfe: 0.138494 hartree
zpe.sumelectzpe: -649.802725 hartree
zpe.sumelectthermal: -649.789346 hartree
zpe.sumelectthermalent: -649.788401 hartree
zpe.sumelectthermalfe: -649.845134 hartree
dipole: -0.0452 -1.7770 0.5023
dipole: 1.8472
quadrupole: -58.0103 -96.7504 -80.9393
quadrupole: -5.6518 1.4694 -0.6550
quadrupole: 20.5563 -18.1837 -2.3726 -5.6518 1.4694 -0.6550
hfenergy: -649.9836285 hartree
pointgroup: C01 [X(C11H10O3)]
dipole: -0.1144294 0.7122145 0.0882801 debye
dipolederiv: -1.6586011 -0.3839794 -0.1640295 -0.4711311 -0.5836744 -0.1879608 -0.3808119 -0.2268777 -0.3780627 -0.7903131 0.1824859 0.1554912 -0.0111533 -0.7441605 -0.2918686 -0.0192729 -0.2982466 -0.5142976 -0.4147915 0.1266222 0.067083 -0.0946773 -0.9869133 -0.2236193 -0.0048116 -0.2785399 -0.4267942 -0.5006663 0.0289802 0.0695008 0.1240194 0.0736284 -0.0067097 0.1335539 0.0321696 -0.0390898 -0.1522607 -0.3144199 -0.0730566 -0.3491487 -0.4199928 -0.1090013 -0.1152411 -0.0864698 0.0076122 -0.156484 -0.2257246 -0.0795261 0.0320619 -0.0337882 0.0272508 0.0492291 0.0683526 -0.0868097 -0.2053781 0.0471677 0.027657 -0.1651533 0.0181578 0.0677295 -0.0574079 0.0227433 -0.0822742 1.9559205 -0.0007053 -0.1060252 0.4975213 0.9878823 0.5073289 0.2178243 0.4909016 0.5751202 0.0691761 0.1857737 0.0417199 0.0918468 0.0336517 0.0490365 0.0051026 0.0346708 -0.1192591 0.1975015 -0.0206849 -0.0606262 0.090464 -0.0964943 0.0051363 -0.0195525 0.0140439 -0.1237678 1.1068407 0.1894038 0.0549286 -0.0651022 0.2529475 -0.0886671 0.0877694 0.0178531 0.2623601 0.6883251 0.3128745 -0.0304197 0.2716005 1.215962 0.3536112 -0.0426606 0.3507589 0.2532647 -0.1112914 0.1354922 -0.0230629 0.1721478 -0.0702644 0.0167966 0.0617576 0.0189277 0.1308774 -0.2856695 0.1161527 -0.0061893 0.140506 -0.2134531 0.0468217 -0.0539652 0.0364084 0.10187 0.1290619 0.0584293 0.0257927 0.0291292 0.0311294 -0.0473595 -0.0005439 -0.0607286 0.1315938 0.0931386 0.0174961 0.0155742 0.0714508 0.044139 -0.0481156 0.0436561 -0.0362468 0.1316923 0.0053563 -0.0896192 -0.0128653 -0.1045947 -0.0120631 -0.0489186 -0.0162088 -0.0486553 0.1405263 -0.1059099 -0.0023491 0.0401688 0.013159 0.0967776 -0.0232446 0.0432321 -0.01869 0.1424383 -0.0747984 -0.0251595 0.0142224 -0.0036508 0.0722024 0.0520811 0.0317627 0.011856 -0.0955685 -0.0628804 -0.0756131 -0.0102236 0.0635674 -0.0620678 0.0384195 -0.0048142 0.02777 0.0777378 -0.0828646 -0.0806471 0.0360236 -0.0566955 0.0907337 -0.0123456 0.0543379 -0.0075011 0.0956449 0.1399511 -0.0331852 0.0543358 -0.0930839 0.0869718 0.005988 0.0084388 -0.004978 -0.0900179 0.0717606 -0.1000036 -0.0544661 -0.1351439 0.0820362 -0.0676788 -0.0650983 -0.0722697 0.0092868 0.1448765 -0.0487874 0.0179926 -0.0479394 0.1366521 -0.0147106 0.0437244 0.0127478 -0.1040834 unknown
polarizability: 181.0486376|24.2757608|136.4947969|-9.5987191|27.1861322|75.9075066 unknown
InChI: InChI=1S/C11H10O3/c1-2-7-14-11(13)10-6-4-3-5-9(10)8-12/h2-6,8H,1,7H2
charge 0 multiplicity 1
24 atoms
O  -1.57796 0.177723 -0.111592
O  -1.045344 2.074256 1.116466
O  1.012865 -2.719759 -1.196405
C  0.769449 0.771898 0.140322
C  1.295438 -0.450275 -0.39534
C  1.66098 1.842537 0.42263
C  2.693121 -0.541768 -0.643257
C  -0.670289 1.079496 0.446259
C  3.041421 1.730797 0.168467
C  3.561623 0.531743 -0.374321
C  -3.031742 0.476379 0.144508
C  0.49436 -1.690594 -0.679829
C  -3.83038 -0.408775 -0.768888
C  -4.803493 -1.249377 -0.339422
H  1.239951 2.760466 0.844428
H  3.06601 -1.489329 -1.047626
H  3.706314 2.572061 0.390908
H  4.63367 0.436872 -0.577433
H  -3.244394 0.289036 1.211596
H  -3.187583 1.552265 -0.060108
H  -0.577043 -1.668425 -0.406892
H  -3.604335 -0.320411 -1.839975
H  -5.392299 -1.848231 -1.042161
H  -5.042442 -1.360186 0.725566
