program: Gaussian 09
title: 000246074
version: EM64L-G09RevD.01
frameworkgroup: C1[X(C15H12O2)]
method: RPBEPBE
basis: SDD
operation: Freq
keyword: #pfreq=noraman
keyword: PBEPBE/SDD
title: #p freq=noraman PBEPBE/SDD
converged: YES YES NO NO
title: Mulliken charges:
elementType: O O C C C C C C C C C C C C C C C H H H H H H H H H H H H
charge: -0.265595 -0.217467 0.183085 0.387206 0.402398 -0.699010 -0.419368 -0.391095 -0.450311 -0.429588 -0.243098 -0.262952 -0.242464 0.289968 -0.391355 0.245807 -0.464496 0.256063 0.249239 0.235914 0.266929 0.239330 0.237798 0.228630 0.227229 0.228977 0.268814 0.249593 0.279821
chargesum: 0.00000
title: Mulliken charges with hydrogens summed into heavy atoms:
elementType: O O C C C C C C C C C C C C C C C
charge: -0.265595 -0.217467 0.183085 0.387206 0.402398 -0.193708 -0.183454 -0.124166 -0.210981 -0.191789 -0.014468 -0.035723 -0.013488 0.289968 0.127052 0.245807 -0.184675
polarizability: 2.14731349e+02 9.23573113e-01 1.93455811e+02 2.57870835e+01 4.47210544e-01 8.96835321e+01
1716.lowfreq: -9.3899 -0.0006 -0.0006 -0.0005 3.4391 6.7567 9.6599 21.2117 40.5088
frequency: 8.6804 21.0649 40.4773 56.5428 86.0777 144.4260 178.0390 204.2756 237.9314 261.4782 282.7912 307.6619 363.4250 417.0790 432.5719 468.0686 472.7623 505.6185 528.0989 537.7503 562.9416 609.3475 632.7946 634.5972 682.3709 685.4890 731.3842 747.5528 785.0159 785.6380 802.5627 819.9449 861.3047 885.6793 901.3274 921.8525 941.0301 965.3018 966.5128 986.7741 995.1514 1006.7405 1021.8212 1042.2709 1071.0513 1090.3233 1150.8094 1174.9845 1182.6707 1212.9341 1236.3181 1239.6869 1252.2277 1277.4909 1300.5912 1338.3810 1380.9072 1406.2279 1420.3692 1443.1932 1446.5355 1456.4337 1465.0102 1519.0038 1589.7099 1600.5698 1634.5048 1656.9409 2149.6024 3014.6307 3024.3794 3087.2456 3090.3084 3121.5154 3123.8444 3133.1183 3133.7742 3150.7939 3159.0969 3164.4698 3424.9063
redmass: 4.8935 6.8080 4.6314 5.7270 5.5378 4.5621 4.0774 5.3663 4.9963 4.7527 4.4392 2.3845 3.7246 3.3528 2.7148 4.8352 3.5764 6.1791 4.5116 6.9879 3.9782 5.2237 1.2334 3.5099 1.2813 4.7514 3.3502 1.4306 5.1871 2.7870 2.0762 2.1349 2.7156 2.3569 4.1251 1.6348 2.0919 2.5668 1.7329 1.3702 1.3442 2.2093 3.3377 2.3851 2.9491 2.0901 1.4515 1.1710 1.1814 1.3849 1.1136 1.7565 1.8100 1.6188 1.5517 1.2943 2.0533 3.1345 5.1870 2.1912 1.1022 2.4914 1.1446 3.6986 7.5448 5.3167 6.4883 9.8137 6.0010 1.0581 1.0599 1.1040 1.1017 1.0861 1.0861 1.0901 1.0910 1.0945 1.0992 1.1000 1.1605
irintensity: 0.2705 0.8289 0.0712 0.2573 1.3800 0.6737 2.5925 1.6647 6.3517 1.4919 5.2670 15.1267 4.3367 4.9058 3.8919 2.3920 0.8160 0.9995 24.7602 1.0814 5.4661 4.3431 72.6954 0.2508 57.9711 0.8032 2.2230 7.2247 7.8724 48.7143 50.6884 47.4712 2.8917 16.5367 55.1613 8.5239 2.6273 72.1110 24.0343 3.0532 0.4602 27.1535 6.6690 24.8385 74.5988 147.5768 4.4204 1.5479 0.9275 69.5464 6.8148 3.1977 10.2753 0.8969 38.9454 22.2500 16.1364 4.3408 2.1965 6.6290 19.5387 0.6824 17.9185 9.4259 1.5744 6.9192 0.4263 157.4988 0.8108 18.4329 12.2466 4.1955 3.8977 0.6552 0.0879 3.8158 29.1641 23.1092 35.6784 20.5606 68.5610
temp: 298.150 k
press: 1.00000 atm
elementType: 8 8 6 6 6 6 6 6 6 6 6 6 6 6 6 6 6 1 1 1 1 1 1 1 1 1 1 1 1
symmnumber: 1
zpe: 585301.6 jmol-1
zpe.correction: 0.222930 hartree
zpe.thermalcorrener: 0.237853 hartree
zpe.thermalcorrenthalpy: 0.238797 hartree
zpe.thermalcorrgfe: 0.177468 hartree
zpe.sumelectzpe: -728.002713 hartree
zpe.sumelectthermal: -727.987790 hartree
zpe.sumelectthermalent: -727.986845 hartree
zpe.sumelectthermalfe: -728.048174 hartree
dipole: -0.1535 1.1870 0.7741
dipole: 1.4254
quadrupole: -82.5782 -90.6090 -102.1284
quadrupole: 3.5207 5.8921 -5.5653
quadrupole: 9.1936 1.1628 -10.3565 3.5207 5.8921 -5.5653
hfenergy: -728.2256423 hartree
pointgroup: C01 [X(C15H12O2)]
dipole: -0.101205 -0.4806915 -0.2705369 debye
polarizability: 213.6605792|-4.4258868|193.5810066|-27.2910037|-4.6386025|90.6291054 unknown
InChI: InChI=1S/C15H12O2/c1-2-10-17-15(16)11-13-8-5-7-12-6-3-4-9-14(12)13/h1,3-9H,10-11H2
charge 0 multiplicity 1
29 atoms
O  2.402295 -0.57437 -0.239215
O  2.133338 1.45188 0.902463
C  -1.408141 -0.019243 -0.288798
C  -0.611714 1.142563 -0.616141
C  -2.762292 0.173382 0.19761
C  0.812802 0.996364 -1.146078
C  -1.154662 2.421307 -0.446295
C  -0.917681 -1.363017 -0.423263
C  -3.27687 1.502867 0.352205
C  -3.563992 -0.972296 0.517108
C  -2.485954 2.60748 0.038879
C  -1.724091 -2.458677 -0.103872
C  -3.059524 -2.265348 0.369979
C  1.829009 0.698889 -0.044015
C  3.445958 -0.989366 0.757506
C  4.790752 -0.886514 0.18329
C  5.931488 -0.819472 -0.277694
H  0.885427 0.211456 -1.91619
H  1.124298 1.952143 -1.603517
H  -0.544926 3.299946 -0.68597
H  0.10547 -1.533926 -0.772714
H  -4.300426 1.635868 0.722313
H  -4.585965 -0.813052 0.881703
H  -2.877893 3.623005 0.159568
H  -1.332753 -3.476069 -0.215411
H  -3.680353 -3.133704 0.616334
H  3.347599 -0.347974 1.652623
H  3.195241 -2.03359 1.006595
H  6.925158 -0.751033 -0.682405
