program: Gaussian 09
title: 000019954
version: EM64L-G09RevD.01
frameworkgroup: C1[X(C10H10N4)]
method: RPBEPBE
basis: SDD
operation: Freq
keyword: #pfreq=noraman
keyword: PBEPBE/SDD
title: #p freq=noraman PBEPBE/SDD
converged: NO YES NO NO
title: Mulliken charges:
elementType: N N N N C C C C C C C C C C H H H H H H H H H H
charge: -0.341378 -0.059617 -0.071142 -0.032477 -0.468313 0.387188 -0.384427 -0.383655 -0.222484 -0.222502 0.111393 -0.231582 -0.295682 -0.298162 0.243651 0.245096 0.346828 0.239701 0.239833 0.230758 0.230831 0.233210 0.251609 0.251323
chargesum: 0.00000
title: Mulliken charges with hydrogens summed into heavy atoms:
elementType: N N N N C C C C C C C C C C
charge: 0.005449 -0.059617 -0.071142 -0.032477 0.020434 0.387188 -0.144726 -0.143822 0.008274 0.008329 0.111393 0.001628 -0.044073 -0.046839
polarizability: 2.01915068e+02 1.15314018e+01 9.52869226e+01 -5.77572960e-01 -3.93686755e-02 1.00090112e+02
1716.lowfreq: -24.2427 -6.3326 0.0008 0.0008 0.0009 4.9586 9.8232 23.2404 62.5480
frequency: -23.7255 23.2172 62.5248 103.9350 153.8559 196.6046 243.7324 314.8084 356.0494 401.5535 416.5177 526.1860 532.4758 538.6633 580.8884 616.9549 635.5976 670.2775 705.3255 760.0909 803.6580 807.1426 856.1241 872.6752 917.7295 934.6722 935.4072 943.4169 979.0225 980.2807 990.5283 1000.0529 1025.7565 1079.3389 1087.7263 1100.6093 1130.5803 1174.3337 1187.8819 1210.9695 1219.6682 1247.8937 1322.7790 1324.8371 1355.1039 1375.2257 1384.0060 1393.2305 1439.7893 1463.8685 1483.0250 1488.6171 1494.5276 1563.6385 1594.7989 1616.0294 2995.0701 3042.7625 3122.4838 3123.4431 3137.1299 3149.6753 3155.6349 3162.0965 3166.2914 3557.2398
redmass: 3.9779 4.6110 5.2482 6.0529 6.3282 6.0447 5.0555 2.2179 3.3409 2.8011 4.5996 3.4670 1.9676 6.7847 1.3768 6.3289 6.4579 9.0482 1.8389 1.8212 8.8058 4.7744 1.2448 4.1334 3.3536 1.5296 2.0875 1.6253 1.3906 1.4747 6.2946 1.3168 2.2318 5.7835 1.5244 4.0581 4.7919 1.0541 1.1172 1.1109 2.4461 4.8844 1.6471 1.2735 1.6425 1.4386 8.3798 1.5780 2.1708 2.9677 1.7133 1.3259 3.4448 7.3040 6.0872 6.1771 1.0594 1.1037 1.0859 1.0885 1.0915 1.0961 1.0915 1.0951 1.1016 1.0777
irintensity: 0.5197 0.1575 0.0091 1.6573 1.0463 0.2815 0.7923 1.7789 0.8188 0.0564 3.7731 36.9358 30.5685 7.8703 47.0855 0.2645 0.0416 6.3980 52.9119 52.0171 21.4305 2.0710 0.2538 0.1814 13.9617 11.1147 18.3012 3.3261 0.0315 0.0132 0.5638 0.2992 9.0080 16.0891 8.2375 3.6261 7.7034 0.0212 0.9850 0.3335 2.4665 11.4166 17.4574 0.4587 153.9849 39.6728 0.1743 12.0317 8.7909 60.7794 38.1835 8.1849 46.0353 997.2892 1.1359 2.6755 22.2155 12.2899 7.0019 2.4911 11.8082 35.6778 26.4172 18.6623 19.6157 78.7630
temp: 298.150 k
press: 1.00000 atm
elementType: 7 7 7 7 6 6 6 6 6 6 6 6 6 6 1 1 1 1 1 1 1 1 1 1
symmnumber: 1
zpe: 491880.7 jmol-1
zpe.correction: 0.187347 hartree
zpe.thermalcorrener: 0.197986 hartree
zpe.thermalcorrenthalpy: 0.198930 hartree
zpe.thermalcorrgfe: 0.149170 hartree
zpe.sumelectzpe: -605.075385 hartree
zpe.sumelectthermal: -605.064746 hartree
zpe.sumelectthermalent: -605.063802 hartree
zpe.sumelectthermalfe: -605.113562 hartree
dipole: 3.9350 0.0829 -0.0221
dipole: 3.9359
quadrupole: -86.6310 -84.1117 -76.1825
quadrupole: 2.8870 0.0344 -0.0015
quadrupole: -4.3226 -1.8033 6.1259 2.8870 0.0344 -0.0015
hfenergy: -605.2627324 hartree
pointgroup: C01 [X(C10H10N4)]
dipole: -1.5479047 -0.0426927 -0.0082422 debye
dipolederiv: -1.9383687 0.0351338 -0.0105867 -0.1991666 -0.2282827 -0.0048296 0.0056284 -0.0039172 -0.3963359 -1.2560181 0.0464829 -0.0110885 -0.646137 -0.4634477 0.00503 0.0110276 0.0115526 -0.1832762 -1.3326321 -0.0701318 -0.0067757 0.4993376 -0.4700027 0.0134254 -0.0316494 0.0082803 -0.2108029 -0.7539098 0.0416188 -0.0070362 0.0115911 -0.9511428 0.0285333 -0.0072246 0.0283116 -0.1625179 0.7179893 -0.1195278 0.0061318 -0.3238101 0.3969188 -0.0119055 0.0048105 -0.0120636 0.2664831 0.2042526 0.0725226 -0.0033577 0.0409955 -0.0987144 0.0053147 -0.0031467 0.0051045 -0.0064886 -0.1037475 0.0276244 -0.0731328 0.0201183 -0.1399873 -0.0211851 -0.0361111 -0.013405 0.0445322 -0.1030195 0.0338126 0.0730231 0.0209116 -0.1354778 0.0355083 0.0390336 0.0280933 0.0370319 -0.0470888 0.0420857 0.0876406 0.0491246 -0.1269459 0.03647 0.0942661 0.0332515 0.0780909 -0.0485282 0.0336819 -0.0881401 0.0413315 -0.1314122 -0.0189758 -0.0935713 -0.0152044 0.087017 2.3431175 0.0140813 0.0164349 0.3141929 0.296217 -0.0008111 0.0140549 -0.0019523 0.2399186 0.0676778 0.0874156 -0.0055043 0.0741605 -0.1291128 0.0021518 -0.0062023 0.0019629 -0.0605618 0.9724243 -0.1290767 0.0145897 0.0404013 0.6994018 -0.0248626 0.009979 -0.026658 0.000846 0.9185392 0.1065562 0.0055802 0.0470887 0.7187745 -0.0253247 0.0082938 -0.0241257 0.0045379 -0.0311064 -0.0148308 0.0132183 0.1045946 0.0111406 0.0469038 -0.0016663 0.1021507 -0.0557281 -0.0253807 -0.0188123 -0.0137018 0.0989532 0.0000462 -0.0488579 -0.0085211 -0.1035624 -0.0366039 0.2671908 0.0324577 -0.0036078 0.0719557 0.1558249 0.0053235 -0.0067562 0.0040843 0.2758699 0.0636714 -0.038139 0.0965628 -0.0416348 0.1333182 0.0280818 0.0968527 0.0164772 -0.0454066 0.0595931 -0.0469529 -0.094458 -0.0512219 0.1279433 -0.0417496 -0.0951708 -0.0303597 -0.0359345 0.0276905 -0.0400466 -0.0810189 -0.0497983 0.1424511 -0.0341527 -0.0987976 -0.0358598 -0.0619532 0.0318762 -0.0322959 0.0814412 -0.0399434 0.1470127 0.0163747 0.1004211 0.0181184 -0.0703604 -0.105758 -0.0830165 0.0056866 -0.0911483 0.1336816 -0.0010019 0.0061362 -0.0010351 0.088375 0.0484655 -0.0661436 0.0018897 -0.0849159 -0.0549937 0.0046541 0.0023969 0.0048443 0.1001848 0.0230695 0.0855006 -0.0037904 0.0930195 -0.0332108 0.0058851 -0.0040834 0.0059118 0.1030829 unknown
polarizability: 201.7654713|12.2149741|95.4481133|0.1539424|0.2484773|100.0785177 unknown
InChI: InChI=1S/C10H10N4/c1-2-4-9(5-3-1)6-12-10-13-7-11-8-14-10/h1-5,7-8,12H,6H2
charge 0 multiplicity 1
24 atoms
N  0.501684 -0.278463 -0.014833
N  2.41822 1.097966 -0.042817
N  2.587355 -1.350612 0.047293
N  4.603961 0.017882 0.022896
C  -0.40879 0.887575 -0.066873
C  -1.857973 0.427005 -0.030472
C  -2.556194 0.147708 -1.232771
C  -2.527661 0.254651 1.207667
C  -3.896862 -0.298179 -1.199161
C  -3.868164 -0.191111 1.245041
C  1.859322 -0.169545 -0.003735
C  -4.55569 -0.469121 0.040644
C  3.777441 1.109511 -0.026288
C  3.932165 -1.180643 0.05746
H  -0.19787 1.467858 -0.984851
H  -0.18081 1.556103 0.784128
H  0.114127 -1.223946 0.01421
H  -2.049398 0.284549 -2.195977
H  -1.998079 0.474431 2.142842
H  -4.426437 -0.507159 -2.135247
H  -4.37529 -0.316588 2.208068
H  -5.59627 -0.811215 0.067699
H  4.259658 2.091841 -0.05563
H  4.543454 -2.087701 0.097007
