program: Gaussian 09
title: 000246067
version: EM64L-G09RevD.01
frameworkgroup: C1[X(C7H13ClO3)]
method: RPBEPBE
basis: SDD
operation: Freq
keyword: #p
keyword: freq=noraman
keyword: PBEPBE/SDD
title: #p freq=noraman PBEPBE/SDD
converged: YES YES NO NO
title: Mulliken charges:
elementType: Cl O O O C C C C C C C H H H H H H H H H H H H H
charge: -0.046539 -0.278092 -0.253865 -0.272657 0.001309 -0.019936 -0.360795 -0.393610 -0.590020 -0.260764 -0.498188 0.228580 0.257670 0.229121 0.221541 0.224097 0.229774 0.282688 0.258699 0.223092 0.181322 0.232768 0.200607 0.203197
chargesum: 0.00000
title: Mulliken charges with hydrogens summed into heavy atoms:
elementType: Cl O O O C C C C C C C
charge: -0.046539 -0.278092 -0.253865 -0.272657 0.229889 0.237735 0.089867 0.060261 -0.048633 0.143650 0.138385
polarizability: 1.09522161e+02 -8.53533474e-01 9.46873192e+01 -2.81129101e+00 1.96495925e+00 7.36089875e+01
1716.lowfreq: -5.3058 -0.0025 -0.0018 -0.0010 1.7930 4.9887 23.4569 47.3587 64.1128
frequency: 23.2547 47.3466 64.0827 81.2344 89.0729 128.9814 152.1232 188.6862 225.9043 271.1361 316.8399 326.2301 404.5947 451.1512 505.2487 653.0629 682.9223 735.6841 758.1176 824.0802 841.1313 870.8172 890.3907 916.2445 958.4733 980.0349 1004.6686 1049.9470 1083.9187 1085.4627 1103.9536 1111.4066 1124.3703 1159.1215 1162.0353 1181.7121 1193.4530 1236.5221 1255.2207 1274.3537 1277.2939 1291.0903 1326.6722 1350.4471 1360.4452 1388.2264 1438.5553 1439.6997 1454.0249 1458.1160 1470.1941 1471.6747 1493.1512 2914.0803 2926.3956 2986.9237 2995.9417 2997.7266 3012.7136 3017.5145 3048.1728 3063.9857 3082.3324 3095.7443 3102.3270 3136.8966
redmass: 4.4668 4.7055 3.0982 3.5058 2.6842 2.5808 4.5811 3.2141 1.2143 3.8824 5.4661 3.0680 3.1336 3.1470 3.0400 5.0210 5.1278 3.2810 3.5754 1.6043 4.8765 2.2432 2.7066 4.2377 2.1869 2.6189 2.6335 4.4107 2.5633 3.1006 1.7785 1.8394 1.7850 1.4688 1.1744 1.2301 1.2858 1.3313 1.2022 1.2163 1.2187 1.2865 1.2688 1.2741 1.3325 1.3844 1.1022 1.1639 1.0881 1.0510 1.0607 1.0853 1.0770 1.0577 1.0380 1.0986 1.0644 1.1027 1.0664 1.0808 1.0577 1.0873 1.1035 1.1018 1.0972 1.1094
irintensity: 3.6887 2.0031 6.5785 2.4609 5.8792 2.7272 1.5071 0.6467 4.2469 7.4694 1.5174 5.8273 1.2867 14.6072 26.1894 28.6810 7.0691 11.9493 4.5783 11.4866 29.0865 30.5246 0.7785 18.8582 42.3865 16.8904 41.4407 112.6122 97.6358 28.1189 7.8493 48.9580 14.6114 2.5564 7.0622 8.0564 5.8080 10.0909 2.0692 14.9384 6.6629 1.2247 5.0507 20.8875 10.8889 29.0337 11.5727 0.8027 10.0478 12.1480 11.0306 10.4271 4.9406 49.2942 97.7790 49.7001 46.2982 63.7283 10.9200 41.9709 14.3385 18.4519 38.1459 24.1633 33.0168 13.2064
temp: 298.150 k
press: 1.00000 atm
elementType: 17 8 8 8 6 6 6 6 6 6 6 1 1 1 1 1 1 1 1 1 1 1 1 1
symmnumber: 1
zpe: 514474.0 jmol-1
zpe.correction: 0.195953 hartree
zpe.thermalcorrener: 0.208542 hartree
zpe.thermalcorrenthalpy: 0.209486 hartree
zpe.thermalcorrgfe: 0.154398 hartree
zpe.sumelectzpe: -959.323614 hartree
zpe.sumelectthermal: -959.311025 hartree
zpe.sumelectthermalent: -959.310081 hartree
zpe.sumelectthermalfe: -959.365169 hartree
dipole: -0.2826 0.9384 0.7129
dipole: 1.2118
quadrupole: -72.0853 -77.1811 -70.3915
quadrupole: -15.1438 -4.3122 3.2390
quadrupole: 1.1340 -3.9618 2.8278 -15.1438 -4.3122 3.2390
hfenergy: -959.5195671 hartree
pointgroup: C01 [X(C7H13Cl1O3)]
dipole: -0.182468 0.2890066 0.3324034 debye
dipolederiv: -0.2079741 -0.0681665 -0.0326958 -0.1461079 -0.5187138 -0.1275034 -0.0613784 -0.0954069 -0.2071456 -1.0395827 -0.2568258 0.0923033 -0.211653 -0.5580518 0.0227134 0.2247267 0.0576633 -0.4145954 -0.8664546 0.0288943 0.1697025 0.0554604 -0.5709124 -0.0399522 0.2012026 -0.0446284 -0.4808111 -1.0721984 0.2060443 -0.0626439 0.1887282 -0.4612295 0.0245335 -0.1112957 0.0564918 -0.440802 1.2161975 0.097456 -0.1134852 0.2160542 0.6686887 0.03908 -0.1023478 -0.0216786 0.5634612 0.770665 0.2344078 -0.0432117 -0.108676 -0.0176846 -0.0199139 -0.1172909 -0.0503397 0.2855718 0.3325247 -0.0575603 -0.1025263 0.1662026 0.2150754 -0.0515395 -0.1880045 -0.0171943 0.4233825 -0.3139584 0.0527292 -0.0464683 0.0372103 0.0090745 -0.0503341 -0.1315644 -0.0194696 0.0309846 0.0694464 0.0695751 -0.0252655 0.1511462 0.6721589 0.1202804 0.0085583 0.1631545 0.1388311 0.7565938 -0.0124255 0.0745837 0.0282615 0.2352102 -0.0208582 0.117197 -0.0748736 0.4662529 0.5274526 -0.1479962 -0.0344494 -0.3223847 0.4353589 -0.0524672 -0.1027031 -0.0184043 0.3356733 -0.026296 -0.0007344 0.0179172 -0.0325919 0.0282587 -0.0219566 0.0564884 0.0037048 -0.1696297 -0.0030224 -0.0319058 0.00704 -0.0251824 0.0487599 0.0923278 0.0441021 0.0665742 -0.063441 -0.1004162 0.0990445 0.0375453 0.0923814 0.0842364 -0.0030876 0.0013042 0.0257908 0.0780713 -0.0027285 -0.067947 -0.1039833 -0.0778904 0.00659 -0.0107192 -0.0121911 -0.0498057 -0.1657224 0.0707502 0.0135839 0.0415862 0.0255199 0.0758819 -0.0219117 0.0429765 -0.0449248 -0.1105575 0.0386135 -0.0665032 0.0209406 -0.0451033 -0.0637741 0.0661751 0.0302374 0.0741979 0.0594442 0.1021704 -0.0307887 0.0352033 -0.0101653 -0.0581577 0.0551221 -0.0074514 0.027126 -0.0277646 -0.0920366 0.0119968 0.056836 0.0181392 -0.04577 -0.0506759 0.0664173 -0.0730391 0.054105 -0.0048387 -0.0306985 -0.0129956 -0.1075184 -0.1176523 0.0506765 0.0025586 0.095665 0.006802 -0.0412922 0.0198204 0.0329404 -0.0183891 0.0396586 -0.0437313 -0.0347346 -0.0528093 -0.2344533 -0.1356535 -0.0226634 -0.0873045 -0.0490931 0.0616934 -0.0441479 -0.1091235 -0.0330677 0.0608371 0.0129134 0.0400924 0.0191444 0.1092061 0.0177249 -0.0282245 0.1392491 -0.0772366 -0.2055152 0.0091248 -0.0794296 0.0592864 0.0664456 -0.1864242 0.1161143 0.0430672 0.1025105 0.0170206 unknown
polarizability: 109.5770548|1.8673228|93.5403707|-1.3512639|5.3036726|74.7010423 unknown
InChI: InChI=1S/C7H13ClO3/c1-9-3-2-7-10-5-6(4-8)11-7/h6-7H,2-5H2,1H3
charge 0 multiplicity 1
24 atoms
Cl -3.28354 -2.443061 -0.805283
O  -0.712334 -0.588345 -0.12419
O  -1.100671 1.735098 -0.421175
O  3.494328 0.165453 0.275511
C  -0.133594 0.656791 -0.699902
C  -2.028575 -0.257946 0.465217
C  -1.914488 1.267337 0.718827
C  1.236765 0.918954 -0.074569
C  -3.189809 -0.593569 -0.473928
C  2.221617 -0.225412 -0.339882
C  4.515407 -0.86951 0.130635
H  -0.087096 0.560562 -1.801115
H  -2.109977 -0.839019 1.399409
H  -2.87042 1.812856 0.67504
H  -1.407919 1.465398 1.683025
H  1.127022 1.058977 1.015982
H  1.646095 1.854853 -0.497683
H  -3.079658 -0.107133 -1.454458
H  -4.157245 -0.333853 -0.014738
H  1.846068 -1.17185 0.103726
H  2.359882 -0.384949 -1.434562
H  5.419767 -0.484766 0.627853
H  4.741852 -1.073369 -0.938289
H  4.204123 -1.8200 0.614845
