program: Gaussian 09
title: 000246065
version: EM64L-G09RevD.01
frameworkgroup: C1[X(C9H18O3)]
method: RPBEPBE
basis: SDD
operation: Freq
keyword: #pfreq=noraman
keyword: PBEPBE/SDD
title: #p freq=noraman PBEPBE/SDD
converged: NO YES NO NO
title: Mulliken charges:
elementType: O O O C C C C C C C C C H H H H H H H H H H H H H H H H H H
charge: -0.246380 -0.246297 -0.265949 0.275266 -0.370692 -0.370914 0.064165 -0.693534 -0.731237 -0.460798 -0.292761 -0.498622 0.183334 0.230227 0.230330 0.183258 0.178966 0.258723 0.202879 0.202831 0.209877 0.219909 0.219869 0.248397 0.248276 0.194033 0.193933 0.199270 0.234369 0.199270
chargesum: 0.00000
title: Mulliken charges with hydrogens summed into heavy atoms:
elementType: O O O C C C C C C C C C
charge: -0.246380 -0.246297 -0.265949 0.275266 0.042869 0.042675 0.243131 -0.029101 -0.081582 0.035876 0.095205 0.134287
polarizability: 1.37138513e+02 5.72861517e-03 9.20234546e+01 1.35484367e+00 2.55411241e-03 9.26110293e+01
1716.lowfreq: -48.5550 -18.5409 -3.4920 -0.0003 0.0003 0.0007 17.7011 53.9695 73.0446
frequency: -47.8667 53.9123 72.9003 95.2989 140.3642 160.3379 208.1007 216.2097 225.4269 228.3572 265.6507 266.2086 325.1788 336.0380 386.8838 406.8820 415.9398 489.4219 492.3564 569.6512 641.0246 753.3089 772.2973 846.5153 860.4824 898.9277 914.7423 929.3135 940.1554 940.2168 955.6164 998.4467 1020.7102 1048.5556 1061.8596 1088.1373 1088.7801 1118.0600 1119.3849 1160.0491 1179.8426 1185.3444 1202.9998 1207.6244 1268.1670 1275.1974 1281.8167 1307.0740 1317.3970 1347.6236 1358.5339 1371.3184 1376.8036 1397.1645 1401.1760 1438.7628 1449.1770 1454.1391 1457.5092 1458.5753 1466.1775 1469.1275 1471.8612 1479.4322 1486.6193 1490.5328 2843.3049 2906.3159 2916.4468 2921.0248 2926.3313 2955.3836 2967.1052 2976.6412 2989.9103 3033.7337 3060.0151 3062.2292 3066.8485 3072.5035 3074.2610 3098.0037 3100.6940 3102.4741
redmass: 2.7077 3.7500 2.1656 2.8648 3.1605 1.0285 2.0887 1.4946 1.1783 4.3755 2.1149 3.8554 2.4157 2.6193 2.9257 2.0365 2.0248 5.7015 3.7444 5.1531 3.8214 1.6070 3.6005 1.8296 5.6714 1.9688 2.4070 4.1578 1.4640 1.4226 5.1058 2.6191 1.4426 3.8710 3.7275 2.7830 1.6163 2.9230 1.3177 1.5226 2.2247 1.1521 1.8607 1.3503 1.6632 1.3130 1.3683 1.7079 1.1488 1.1982 1.3144 1.3350 1.2275 1.4213 1.3326 1.1641 1.0803 1.0736 1.0513 1.0724 1.0470 1.0614 1.0791 1.0571 1.0601 1.0785 1.0822 1.0518 1.0677 1.0378 1.0677 1.1066 1.0358 1.0370 1.1024 1.0597 1.0986 1.0992 1.0977 1.0959 1.0960 1.0980 1.0967 1.1031
irintensity: 1.0334 0.7698 0.8857 6.0162 0.3796 0.0582 1.5242 0.7168 2.2698 4.0721 2.7992 6.4709 6.9895 0.8354 6.0822 1.4886 5.1076 2.7242 1.7688 1.1623 11.9582 14.3089 3.0078 40.6742 5.4540 27.3344 15.7780 29.5359 17.7506 2.3785 5.1731 51.6359 1.3157 235.8972 5.6426 51.6638 23.7637 8.9288 4.6755 11.2450 3.3125 0.6956 0.3449 4.5172 0.6840 2.3307 1.0852 10.6614 2.7301 1.8018 5.4710 0.4697 23.8398 81.4180 3.3369 2.1313 6.4619 0.0493 12.1112 13.7933 0.0760 10.9268 18.2288 11.2472 24.6656 3.1210 78.5023 48.1984 23.4012 91.1280 143.2717 68.4804 41.2769 30.0728 75.7407 7.4829 27.3133 2.0435 0.8664 93.5138 38.9088 18.0385 33.2513 11.3000
temp: 298.150 k
press: 1.00000 atm
elementType: 8 8 8 6 6 6 6 6 6 6 6 6 1 1 1 1 1 1 1 1 1 1 1 1 1 1 1 1 1 1
symmnumber: 1
zpe: 682977.5 jmol-1
zpe.correction: 0.260132 hartree
zpe.thermalcorrener: 0.273212 hartree
zpe.thermalcorrenthalpy: 0.274156 hartree
zpe.thermalcorrgfe: 0.221036 hartree
zpe.sumelectzpe: -578.386325 hartree
zpe.sumelectthermal: -578.373246 hartree
zpe.sumelectthermalent: -578.372302 hartree
zpe.sumelectthermalfe: -578.425421 hartree
dipole: -1.4100 0.0036 -3.3736
dipole: 3.6564
quadrupole: -62.5645 -77.1972 -74.8935
quadrupole: 0.0274 -5.1895 0.0050
quadrupole: 8.9872 -5.6455 -3.3418 0.0274 -5.1895 0.0050
hfenergy: -578.6464575 hartree
pointgroup: C01 [X(C9H18O3)]
dipole: 0.5714372 -0.2882972 -1.2883218 debye
polarizability: 137.1622908|-0.5503067|92.0541077|-0.6894673|0.1202963|92.5565989 unknown
InChI: InChI=1S/C9H18O3/c1-9(2)6-11-8(12-7-9)4-5-10-3/h8H,4-7H2,1-3H3
charge 0 multiplicity 1
30 atoms
O  0.451768 -1.251784 0.570158
O  0.470883 1.112183 0.053027
O  -4.025275 0.004663 0.444552
C  2.638325 -0.14912 0.025485
C  1.773364 -1.437008 -0.060882
C  1.791621 0.996165 -0.595374
C  -0.268368 -0.147191 -0.068852
C  2.979916 0.172731 1.499284
C  3.924265 -0.342285 -0.810062
C  -1.623297 0.015582 0.621521
C  -2.800865 -0.182531 -0.338722
C  -5.228007 -0.1632 -0.366001
H  1.634657 -1.726493 -1.128797
H  2.242702 -2.274347 0.482242
H  2.275221 1.977114 -0.453374
H  1.651645 0.812126 -1.686246
H  -0.348339 -0.385361 -1.162335
H  2.059373 0.31019 2.090993
H  3.566836 -0.647911 1.953621
H  3.579665 1.100095 1.568637
H  3.694117 -0.572359 -1.868515
H  4.548419 0.57089 -0.788426
H  4.534319 -1.172119 -0.406188
H  -1.676011 1.025726 1.061625
H  -1.693103 -0.717968 1.442423
H  -2.763763 0.557506 -1.171124
H  -2.784808 -1.204846 -0.782075
H  -5.270769 0.578318 -1.193615
H  -6.083348 -0.004406 0.309657
H  -5.288343 -1.184465 -0.801839
