program: Gaussian 09
title: 000020001
version: EM64L-G09RevD.01
frameworkgroup: C1[X(C11H23N2O2)]
method: RPBEPBE
basis: SDD
operation: Freq
keyword: #p
keyword: freq=noraman
keyword: PBEPBE/SDD
title: #p freq=noraman PBEPBE/SDD
converged: YES YES NO NO
title: Mulliken charges:
elementType: O O N N C C C C C C C C C C C H H H H H H H H H H H H H H H H H H H H H H H
charge: -0.259997 -0.351260 -0.102893 -0.120774 -0.366373 -0.364469 -0.436885 -0.280259 -0.388472 -0.523871 -0.552731 -0.549255 -0.600788 0.252023 -0.288375 0.313991 0.273501 0.244777 0.240899 0.250696 0.248007 0.224016 0.232656 0.244008 0.237066 0.266677 0.248289 0.265748 0.262758 0.267283 0.283530 0.259169 0.264177 0.349262 0.249388 0.249670 0.246001 0.212812
chargesum: 1.00000
title: Mulliken charges with hydrogens summed into heavy atoms:
elementType: O O N N C C C C C C C C C C C
charge: -0.259997 -0.351260 -0.102893 -0.120774 0.221119 0.121207 0.061818 0.176413 0.092602 -0.008904 0.243057 0.257621 0.247532 0.252023 0.170437
polarizability: 1.61245761e+02 6.54278150e+00 1.33820532e+02 -4.74584447e+00 2.76411564e+00 1.07367356e+02
1716.lowfreq: -14.6744 -3.3525 -0.0006 -0.0002 0.0005 8.6800 33.6837 38.5615 74.9899
frequency: 33.4693 37.8795 74.9827 85.9537 93.2604 127.5015 145.4122 163.6183 175.3177 184.5290 211.4961 251.6222 263.4624 269.1601 296.6639 312.7596 335.1749 347.7641 391.6249 435.4641 443.5229 472.8080 502.2269 516.7843 567.9838 604.6619 638.2701 723.4856 730.7705 791.8217 819.7231 844.6676 888.5436 893.2301 908.4993 918.7799 927.2937 938.7633 954.5352 1011.5786 1046.4791 1051.5546 1054.7156 1062.6130 1076.2505 1079.2154 1098.4431 1125.7270 1140.6575 1159.7854 1188.4445 1193.7661 1202.2175 1218.3920 1222.9462 1246.8336 1258.4721 1260.7258 1281.4543 1287.0502 1302.3829 1318.0300 1325.8156 1347.9891 1360.6387 1365.1208 1403.3702 1417.4933 1425.9512 1434.2301 1439.3222 1446.4124 1452.8160 1454.9262 1457.4049 1466.4598 1469.5615 1474.6254 1476.8141 1480.0553 1486.1901 1489.8234 1497.0333 1507.0781 1608.5512 2965.0016 2971.6626 2982.5332 3003.9905 3008.1313 3011.5833 3023.6240 3026.4902 3035.4201 3035.9443 3052.4088 3054.5405 3060.4171 3088.9130 3090.6048 3110.7699 3122.8858 3132.4004 3138.5568 3141.3185 3144.2842 3146.9931 3149.4304
redmass: 3.0080 4.2437 3.6666 3.2653 3.4872 2.2234 1.8633 3.3372 2.7127 3.0622 1.1414 2.5225 1.2954 1.0946 3.3320 2.8541 2.5828 2.3220 2.5025 2.3569 2.6591 2.7523 2.7946 2.9066 3.3022 2.7723 4.1768 2.6752 3.9584 1.6728 1.8626 1.9216 2.8895 1.6678 2.3620 2.9439 2.7053 2.6693 2.6096 2.1631 3.2354 2.4586 1.2973 1.5860 1.9619 2.0027 2.3391 1.6106 1.4711 1.3031 1.6985 1.4817 1.3809 1.2333 1.7564 1.1858 1.8822 1.4388 1.3489 2.0466 1.4378 1.2454 1.4256 1.2654 1.2432 1.2531 1.2727 2.4648 1.1557 1.1422 1.0845 1.1014 1.1007 1.0484 1.1066 1.0583 1.1139 1.0564 1.0803 1.0970 1.0559 1.0692 1.1202 1.0555 7.4313 1.0624 1.0664 1.0630 1.0611 1.0661 1.0332 1.0322 1.0332 1.0683 1.0629 1.0942 1.0965 1.1012 1.0965 1.0978 1.1046 1.1076 1.1070 1.1052 1.1051 1.1050 1.1049 1.1053
irintensity: 0.9373 6.5764 6.2958 2.8635 3.2537 3.0018 2.4099 9.4005 6.4113 2.8079 0.4972 6.0613 4.6538 1.6115 6.3910 7.9868 4.3505 2.4529 0.8347 0.6620 14.1400 0.7126 0.5741 3.4540 13.8667 5.8104 11.2487 11.4611 1.6923 20.5352 12.4973 9.8459 31.6836 8.9810 5.3992 11.7828 8.9616 2.0655 12.2193 15.1313 76.2606 7.3268 7.0868 6.0119 1.7834 20.9306 9.3696 4.9323 2.5218 2.7658 2.2150 4.6057 0.1225 7.2621 0.8502 3.8745 1.6419 3.8102 0.4891 79.7386 24.9494 5.1349 1.5635 9.5151 8.5091 0.7703 5.4425 70.0390 15.7672 13.5889 14.5859 19.8393 3.3882 0.8303 6.5768 6.7713 33.5400 9.5637 5.3589 18.2504 55.4317 43.6806 12.2004 73.7419 413.2217 43.4052 57.6382 41.6048 40.4202 15.1476 46.9043 3.3753 6.9004 15.0865 11.5796 28.5582 27.4810 6.4104 5.3469 19.1624 22.3563 0.3409 27.0091 2.6016 3.3190 8.0478 8.2960 6.7515
temp: 298.150 k
press: 1.00000 atm
elementType: 8 8 7 7 6 6 6 6 6 6 6 6 6 6 6 1 1 1 1 1 1 1 1 1 1 1 1 1 1 1 1 1 1 1 1 1 1 1
symmnumber: 1
zpe: 891198.8 jmol-1
zpe.correction: 0.339440 hartree
zpe.thermalcorrener: 0.356369 hartree
zpe.thermalcorrenthalpy: 0.357314 hartree
zpe.thermalcorrgfe: 0.294849 hartree
zpe.sumelectzpe: -691.447431 hartree
zpe.sumelectthermal: -691.430501 hartree
zpe.sumelectthermalent: -691.429557 hartree
zpe.sumelectthermalfe: -691.492021 hartree
dipole: -6.6490 0.0612 0.0501
dipole: 6.6494
quadrupole: -23.7753 -76.7429 -86.6258
quadrupole: 5.9004 -0.3951 6.3196
quadrupole: 38.6060 -14.3616 -24.2444 5.9004 -0.3951 6.3196
hfenergy: -691.7868703 hartree
pointgroup: C01 [X(C11H23N2O2)]
dipole: 2.6114053 0.0718227 -0.1390608 debye
polarizability: 161.5122697|5.4021768|131.038006|3.9736667|8.9539656|109.8833738 unknown
InChI: InChI=1S/C11H23N2O2/c1-13(2,3)8-10-15-9-7-12-6-4-5-11(12)14/h4-10H2,1-3H3
charge 1 multiplicity 1
38 atoms
O  0.268312 -1.233169 -1.774671
O  -0.133397 0.547764 0.989085
N  3.277931 0.440658 -0.220008
N  -2.021223 -0.562339 0.122255
C  2.064736 0.114738 -1.118797
C  -3.394245 -0.259199 -0.354007
C  -3.691922 1.129785 0.281836
C  1.505605 -1.311623 -0.991583
C  -1.40764 -1.887737 0.006755
C  -2.290291 1.749205 0.521946
C  4.507682 -0.346723 -0.658729
C  3.558719 1.937059 -0.364985
C  2.960331 0.150246 1.253186
C  -1.346372 0.546287 0.589852
C  -0.781601 -2.18781 -1.377498
H  1.259014 0.799121 -0.812515
H  2.367488 0.322871 -2.159433
H  -4.099711 -1.03989 -0.018722
H  -3.421094 -0.220644 -1.460968
H  -4.216083 0.995104 1.242942
H  -4.329124 1.748497 -0.368808
H  2.173702 -2.087008 -1.420196
H  1.288424 -1.541742 0.066766
H  -2.175578 -2.660056 0.2046
H  -0.646864 -1.970572 0.803926
H  -2.219655 2.345107 1.445962
H  -1.973343 2.401016 -0.314594
H  4.74495 -0.09257 -1.703392
H  5.354677 -0.082869 -0.00662
H  4.300082 -1.423331 -0.574841
H  2.701142 2.494792 0.039995
H  4.470734 2.189313 0.197646
H  3.695393 2.178164 -1.430308
H  1.942537 0.512796 1.469698
H  3.0149 -0.934285 1.427076
H  3.71252 0.658958 1.875586
H  -1.532332 -2.097444 -2.179582
H  -0.388403 -3.226469 -1.37805
