program: Gaussian 09
title: 000246063
version: EM64L-G09RevD.01
frameworkgroup: C1[X(C15H26O2)]
method: RPBEPBE
basis: SDD
operation: Freq
keyword: #pfreq=noraman
keyword: PBEPBE/SDD
title: #p freq=noraman PBEPBE/SDD
converged: YES YES NO NO
title: Mulliken charges:
elementType: O O C C C C C C C C C C C C C C C H H H H H H H H H H H H H H H H H H H H H H H H H H
charge: -0.237576 -0.252494 0.280352 -0.371675 -0.377250 -0.695373 -0.733309 -0.011927 -0.428570 0.492281 -0.543088 -0.459214 -0.855437 -0.305237 0.372355 -0.784638 -0.793704 0.229488 0.180789 0.185262 0.229019 0.201685 0.202099 0.260587 0.219363 0.210266 0.219228 0.192042 0.256928 0.217971 0.220006 0.211720 0.215556 0.225487 0.226604 0.259245 0.217075 0.228500 0.215083 0.214875 0.219156 0.219732 0.226739
chargesum: 0.00000
title: Mulliken charges with hydrogens summed into heavy atoms:
elementType: O O C C C C C C C C C C C C C C C
charge: -0.237576 -0.252494 0.280352 0.038601 0.037031 -0.031003 -0.084452 0.180115 -0.171642 0.492281 -0.105111 -0.031938 -0.144101 -0.088162 0.372355 -0.126179 -0.128077
polarizability: 2.51988626e+02 -1.10293461e+01 1.50423450e+02 -7.87397354e+00 -5.20094093e-01 1.27504665e+02
1716.lowfreq: -8.7202 -4.3053 -0.0007 0.0006 0.0009 5.0718 15.2931 24.4575 33.6232
frequency: 14.8043 24.2387 32.9065 40.5377 53.7486 82.1018 105.6808 112.3919 118.4243 152.4892 183.3483 185.1794 194.5634 211.5599 221.7942 239.2508 266.9732 290.8775 294.8637 322.5639 356.3840 361.8182 388.4213 403.0339 414.0533 436.0189 462.3346 480.2329 489.5634 525.1476 569.7447 589.1416 641.9165 753.1802 770.6089 780.2210 801.8400 830.1361 857.2128 879.0134 897.4602 906.4178 925.0088 940.2151 941.7089 946.7715 953.2524 973.0474 988.9502 994.2365 997.8511 1009.2175 1019.9977 1041.4888 1045.8489 1057.0099 1082.1018 1113.1722 1137.4405 1158.9000 1178.5064 1194.8906 1198.7137 1216.0091 1227.6795 1255.8740 1270.0040 1271.2901 1297.7115 1315.2821 1318.9118 1324.4163 1342.9410 1357.8001 1358.4612 1373.4459 1376.6722 1388.3613 1393.6857 1396.8413 1398.4311 1444.9630 1452.2014 1454.4868 1455.8224 1461.9607 1464.0751 1467.4095 1471.0311 1471.9798 1473.6775 1479.4323 1480.7163 1484.1935 1489.0225 1692.5622 1695.5862 2863.5765 2913.5631 2927.1352 2956.4835 2961.8994 2963.4375 2968.0774 2969.4023 2974.4889 2978.9808 3026.4511 3027.1938 3031.0655 3040.9403 3051.2122 3061.3034 3063.3897 3065.9710 3070.4691 3071.1362 3074.3134 3080.2328 3091.3422 3101.0815 3101.5027 3131.0401
redmass: 3.2616 3.6493 3.1520 3.1068 3.0087 2.7569 2.0381 1.5001 1.1849 2.0770 1.0585 1.1644 2.8119 3.0721 1.3678 2.5078 2.4193 2.3962 2.6795 2.5587 2.5571 2.9664 2.2995 1.9711 2.1668 2.5147 2.7931 3.8394 2.9578 3.2836 4.9800 2.8682 3.5827 1.6145 3.4797 1.9177 2.2375 1.8800 1.9820 2.4273 2.1510 2.8062 2.6782 1.4581 1.9348 1.3869 2.8094 1.6341 2.8284 1.2806 1.8798 2.7708 1.4382 1.6538 2.9713 1.7761 1.6645 1.7109 2.2105 1.5591 1.8781 1.2961 1.9867 1.8423 1.9374 1.4690 2.0720 1.1809 1.8269 1.1713 1.6347 1.3756 1.2243 1.4073 1.3272 1.4798 1.2883 1.3156 1.2643 1.2117 1.2312 1.0796 1.0764 1.0662 1.0647 1.0610 1.0729 1.0482 1.0716 1.0486 1.0728 1.0575 1.0838 1.0631 1.0599 7.0342 6.7325 1.0822 1.0679 1.0680 1.0373 1.0560 1.0438 1.0354 1.0397 1.0630 1.0370 1.0958 1.0969 1.0964 1.0961 1.0959 1.0984 1.0977 1.0981 1.0935 1.0973 1.0960 1.0965 1.0959 1.0968 1.0981 1.0907
irintensity: 0.2429 0.1787 0.2952 0.5638 0.5898 0.5039 0.5248 0.1097 0.3262 0.9760 0.1502 1.6974 1.0470 2.9094 0.6608 1.3454 4.0845 0.6598 3.7859 1.3167 1.0937 1.1293 2.6740 0.9331 0.8799 9.9446 2.2512 6.8006 2.0813 2.5154 3.9668 4.7235 10.1147 3.8993 1.6381 6.1710 1.4968 29.7547 4.4036 33.6183 63.6440 25.7503 8.4795 13.1141 26.5243 1.0276 4.9741 4.7335 30.2314 8.6288 12.9882 42.5177 0.4388 12.7412 168.5932 3.7457 3.4356 58.8796 3.6661 4.2256 8.2016 1.1711 3.7274 7.3756 2.6673 10.5203 2.1149 0.2938 20.5618 5.7813 0.4204 6.8945 5.7476 7.1311 3.6593 24.9214 33.1394 21.1895 26.9246 23.6076 9.8085 4.9734 1.2079 1.7482 1.2225 16.4996 2.6304 0.6549 17.5999 27.0843 11.1598 10.4739 12.3510 11.7921 24.6051 51.5344 6.8721 59.0193 37.8059 109.8033 42.1987 16.5750 48.2891 42.5710 30.7106 51.5245 34.0100 2.8922 7.7546 49.4465 24.3213 20.1363 20.1847 4.0161 4.0370 25.1907 72.9029 67.0846 57.8412 46.0526 24.8963 14.1366 9.2970
temp: 298.150 k
press: 1.00000 atm
elementType: 8 8 6 6 6 6 6 6 6 6 6 6 6 6 6 6 6 1 1 1 1 1 1 1 1 1 1 1 1 1 1 1 1 1 1 1 1 1 1 1 1 1 1
symmnumber: 1
zpe: 987093.6 jmol-1
zpe.correction: 0.375964 hartree
zpe.thermalcorrener: 0.396636 hartree
zpe.thermalcorrenthalpy: 0.397580 hartree
zpe.thermalcorrgfe: 0.324467 hartree
zpe.sumelectzpe: -736.224011 hartree
zpe.sumelectthermal: -736.203339 hartree
zpe.sumelectthermalent: -736.202395 hartree
zpe.sumelectthermalfe: -736.275508 hartree
dipole: 0.7478 1.6171 -1.1232
dipole: 2.1061
quadrupole: -85.6912 -105.0634 -108.5314
quadrupole: 1.2164 -4.7360 -1.9034
quadrupole: 14.0708 -5.3014 -8.7694 1.2164 -4.7360 -1.9034
hfenergy: -736.599975 hartree
pointgroup: C01 [X(C15H26O2)]
dipole: -0.2979657 0.5944815 0.4943766 debye
polarizability: 251.7448923|12.5205633|150.3820563|-7.2758395|2.3307834|127.7897924 unknown
InChI: InChI=1S/C15H26O2/c1-12(2)7-6-8-13(3)9-14-16-10-15(4,5)11-17-14/h7,9,14H,6,8,10-11H2,1-5H3
charge 0 multiplicity 1
43 atoms
O  -2.334521 0.769689 -0.676252
O  -2.507525 -1.305153 0.563284
C  -4.6119 -0.09255 -0.065105
C  -3.708694 1.152123 -0.286007
C  -3.88775 -0.987271 0.978945
C  -4.801782 -0.862899 -1.39257
C  -5.973949 0.360483 0.509154
C  -1.73373 -0.078282 0.375348
C  -0.346895 -0.488006 -0.032243
C  0.741998 0.328956 -0.056266
C  2.099139 -0.206237 -0.49323
C  3.19995 -0.10572 0.611955
C  0.688302 1.798507 0.327434
C  4.500435 -0.746813 0.173454
C  5.708993 -0.148381 -0.038233
C  6.911809 -0.962719 -0.491027
C  5.98724 1.333319 0.148836
H  -4.08086 1.780517 -1.112757
H  -3.672733 1.761017 0.647923
H  -3.86464 -0.471776 1.96687
H  -4.390358 -1.962476 1.091034
H  -5.421832 -1.765696 -1.235947
H  -5.306958 -0.228615 -2.145142
H  -3.82653 -1.176181 -1.800525
H  -6.62703 -0.510382 0.705627
H  -5.854215 0.918063 1.458255
H  -6.501567 1.017915 -0.207109
H  -1.770325 0.506722 1.329361
H  -0.262597 -1.53834 -0.336685
H  2.455265 0.358089 -1.379875
H  2.002862 -1.26417 -0.80414
H  3.352077 0.952631 0.889095
H  2.820757 -0.621323 1.51841
H  1.216549 2.410472 -0.428977
H  1.195256 1.979401 1.295779
H  -0.345176 2.172645 0.3948
H  4.436168 -1.832326 -0.006635
H  6.661833 -2.03099 -0.613166
H  7.305559 -0.588573 -1.457452
H  7.742375 -0.885374 0.239169
H  6.370189 1.778463 -0.791157
H  6.773806 1.488959 0.91419
H  5.098001 1.906883 0.456778
