program: Gaussian 09
title: 000246059
version: EM64L-G09RevD.01
frameworkgroup: C1[X(C13H16O4)]
method: RPBEPBE
basis: SDD
operation: Freq
keyword: #pfreq=noraman
keyword: PBEPBE/SDD
title: #p freq=noraman PBEPBE/SDD
converged: YES YES NO NO
title: Mulliken charges:
elementType: O O O O C C C C C C C C C C C C C H H H H H H H H H H H H H H H H
charge: -0.269081 -0.295570 -0.287600 -0.260266 -0.040447 -0.005012 -0.138691 0.346871 -0.700465 -0.731609 0.089160 -0.367480 -0.322228 -0.225881 -0.229228 0.170444 -0.501307 0.217150 0.205320 0.258626 0.232757 0.236756 0.207335 0.236346 0.212074 0.228434 0.277393 0.273918 0.231574 0.233126 0.244967 0.232035 0.240580
chargesum: 0.00000
title: Mulliken charges with hydrogens summed into heavy atoms:
elementType: O O O O C C C C C C C C C C C C C
charge: -0.269081 -0.295570 -0.287600 -0.260266 0.176703 0.200308 0.119935 0.346871 -0.023617 -0.054755 0.089160 -0.090087 -0.048310 0.005692 0.003898 0.170444 0.216275
polarizability: 1.89574156e+02 1.19226686e+00 1.78957371e+02 6.90858697e+00 6.71498886e+00 9.31349727e+01
1716.lowfreq: -11.9087 -6.4067 -3.3263 0.0006 0.0008 0.0008 11.9158 19.8517 52.1338
frequency: 10.2653 19.7234 52.1314 62.7787 82.5026 99.5882 115.5390 149.0256 173.3489 205.0304 215.0526 227.9950 239.0442 266.5882 287.9719 325.1108 336.7136 360.1344 414.6336 428.9465 492.8870 521.5105 526.8336 597.4321 626.3037 658.0376 672.4684 686.3419 746.0936 769.1559 793.0309 794.8542 841.5462 848.1705 856.5211 868.5888 913.2564 923.9082 985.1927 985.9311 992.7581 1008.2698 1040.0592 1045.2292 1052.6512 1074.9525 1100.9505 1113.9886 1122.2809 1141.1726 1146.8519 1153.8355 1177.2837 1205.7416 1240.8212 1260.2312 1281.7777 1283.2308 1306.1842 1326.5983 1345.8344 1369.1170 1384.4476 1392.0203 1396.0789 1421.7093 1433.4067 1451.4001 1457.2240 1461.6313 1463.9226 1474.0939 1477.1229 1484.2355 1584.3305 1606.9967 1621.9689 2950.7842 2980.0383 2991.0313 3003.5877 3009.7172 3020.1645 3074.9800 3087.5426 3098.4109 3100.1614 3104.9974 3133.4075 3147.2556 3153.6725 3176.8800 3184.5091
redmass: 3.2972 5.4185 5.3395 3.8006 4.1476 1.7064 1.7125 4.0130 3.9683 1.1506 1.1209 4.2940 2.8850 3.0713 3.8787 3.3466 4.5894 5.4513 3.8283 3.9502 4.1798 3.9316 3.7630 4.8053 5.5049 7.1708 7.5782 4.9564 2.5030 5.4655 2.0971 2.0135 3.4097 3.2106 5.1532 2.8382 1.5374 7.0891 1.2277 1.3891 6.4258 1.3414 2.6269 2.9171 3.5166 2.2872 2.5444 1.2677 1.9467 2.0572 1.4683 2.1496 1.0624 2.0797 2.9648 1.1706 1.2853 1.5291 1.1525 1.2858 1.5739 2.2121 1.2525 1.3494 2.5872 1.2162 2.0731 1.0499 1.0487 1.0488 1.0515 1.0504 1.0484 2.6783 6.8717 7.1441 8.3004 1.0843 1.0373 1.0362 1.0295 1.0870 1.0853 1.0974 1.0989 1.1006 1.1001 1.1044 1.0866 1.1047 1.0932 1.0941 1.0964
irintensity: 0.7096 1.9849 2.0553 1.6886 0.6303 3.9607 1.4016 0.8510 2.9994 0.0688 0.8359 5.3505 1.0140 0.5829 3.5093 11.5749 9.8672 0.8789 4.6162 1.0558 1.4619 1.5597 3.7845 1.2470 6.5917 2.1346 5.9628 22.3807 75.0963 8.3980 24.7996 22.6531 2.7305 1.7884 45.4396 43.7002 1.9997 3.6254 16.4412 3.2041 195.5683 0.1905 131.5228 46.1132 87.3092 9.2355 6.5312 0.3210 79.3255 2.3647 53.2408 2.1785 1.3745 71.5027 179.1728 2.5847 1.5792 22.4158 10.7117 4.7803 16.2703 2.2257 20.5639 24.5841 17.2542 27.7525 1.7525 14.1444 10.6421 8.0803 11.9649 9.5592 12.7622 12.8456 21.3750 43.5531 162.0232 43.6265 24.3364 19.9248 40.2263 35.5028 15.1509 32.5690 27.5774 3.1181 51.3711 26.4937 4.5257 17.1265 21.2125 5.2947 10.9562
temp: 298.150 k
press: 1.00000 atm
elementType: 8 8 8 8 6 6 6 6 6 6 6 6 6 6 6 6 6 1 1 1 1 1 1 1 1 1 1 1 1 1 1 1 1
symmnumber: 1
zpe: 695614.9 jmol-1
zpe.correction: 0.264946 hartree
zpe.thermalcorrener: 0.282040 hartree
zpe.thermalcorrenthalpy: 0.282984 hartree
zpe.thermalcorrgfe: 0.217363 hartree
zpe.sumelectzpe: -804.584908 hartree
zpe.sumelectthermal: -804.567814 hartree
zpe.sumelectthermalent: -804.566870 hartree
zpe.sumelectthermalfe: -804.632491 hartree
dipole: -0.1843 -0.2057 0.2704
dipole: 0.3865
quadrupole: -77.1118 -89.6793 -105.1365
quadrupole: -0.4797 -0.4954 1.2308
quadrupole: 13.5307 0.9632 -14.4940 -0.4797 -0.4954 1.2308
hfenergy: -804.8498542 hartree
pointgroup: C01 [X(C13H16O4)]
dipole: -0.0851464 0.0627742 -0.1092515 debye
polarizability: 189.0401415|-0.6878192|179.1997896|-11.0377332|-1.5546677|93.4265686 unknown
InChI: InChI=1S/C13H16O4/c1-8-9(2)17-13(16-8)11-7-5-4-6-10(11)12(14)15-3/h4-9,13H,1-3H3
charge 0 multiplicity 1
33 atoms
O  -1.510391 0.41885 -1.00917
O  -2.058625 -0.8595 0.869117
O  2.957054 1.701073 -0.512819
O  0.935483 2.123157 0.542313
C  -2.988607 0.551295 -0.847327
C  -3.300369 -0.11568 0.536985
C  -0.99448 -0.018081 0.320305
C  0.280051 -0.813694 0.120501
C  -3.416996 2.019849 -0.936405
C  -4.471376 -1.093342 0.54308
C  1.551294 -0.188942 -0.067514
C  0.191664 -2.223343 0.056794
C  2.693131 -0.995853 -0.326804
C  1.333312 -3.015354 -0.186715
C  2.589735 -2.398713 -0.384755
C  1.729761 1.293966 0.030877
C  3.230972 3.153689 -0.432942
H  -3.434641 -0.04104 -1.668679
H  -3.444652 0.680689 1.299811
H  -0.847116 0.875978 0.953934
H  -2.912273 2.621003 -0.159182
H  -3.152322 2.440261 -1.921297
H  -4.512048 2.115761 -0.802366
H  -4.583445 -1.559285 1.537046
H  -5.413325 -0.568243 0.30052
H  -4.310484 -1.891965 -0.202239
H  -0.789294 -2.681711 0.20707
H  3.656317 -0.502723 -0.478326
H  1.24242 -4.10655 -0.225516
H  3.480795 -3.005033 -0.57964
H  2.450954 3.718728 -0.970231
H  4.212807 3.279584 -0.910523
H  3.253393 3.483369 0.619598
