program: Gaussian 09
title: 000246052
version: EM64L-G09RevD.01
frameworkgroup: C1[X(C11H12Cl2O3)]
method: RPBEPBE
basis: SDD
operation: Freq
keyword: #p
keyword: freq=noraman
keyword: PBEPBE/SDD
title: #p freq=noraman PBEPBE/SDD
converged: YES YES NO NO
title: Mulliken charges:
elementType: Cl Cl O O O C C C C C C C C C C C H H H H H H H H H H H H
charge: -0.032264 -0.011902 -0.254363 -0.300579 -0.204680 0.032128 -0.351234 -0.692670 0.473709 -0.312025 -0.312839 0.371082 -0.208013 -0.243632 -0.243841 -0.698539 0.263998 0.217331 0.238654 0.260381 0.223768 0.220773 0.258155 0.256456 0.230517 0.235312 0.300540 0.283777
chargesum: 0.00000
title: Mulliken charges with hydrogens summed into heavy atoms:
elementType: Cl Cl O O O C C C C C C C C C C C
charge: -0.032264 -0.011902 -0.254363 -0.300579 -0.204680 0.296126 0.104752 0.012251 0.473709 -0.312025 -0.054684 0.371082 0.048443 -0.013115 -0.008529 -0.114222
polarizability: 1.53936728e+02 -7.34075674e+00 1.61112686e+02 1.18000617e+01 1.50733353e+01 1.16102430e+02
1716.lowfreq: -8.8272 -5.3863 0.0023 0.0028 0.0033 6.4921 12.6948 25.0590 30.1124
frequency: 12.5302 25.0067 30.0745 46.3799 53.6502 85.7660 132.4784 144.3694 146.4820 185.8963 209.0369 229.3673 242.7527 292.9574 303.8438 361.8808 385.4627 414.3500 440.3632 442.8536 532.2972 536.9217 555.7021 561.2597 660.2319 663.2948 706.6798 716.8368 751.8253 767.6319 792.4862 840.9725 886.9812 914.1090 921.9562 927.1555 931.5893 969.1231 990.3548 1023.0897 1041.5601 1066.3515 1101.8836 1113.5428 1131.2556 1155.0383 1160.4540 1173.0887 1221.5215 1251.0392 1266.8629 1283.6161 1300.7458 1342.3843 1369.1070 1376.7465 1392.6842 1422.9340 1426.5580 1458.4936 1467.5764 1468.6148 1480.1404 1575.1102 1600.5823 1675.5888 2994.7706 3007.5181 3045.5365 3055.1851 3078.5126 3093.0347 3108.9736 3136.4367 3137.7302 3155.9395 3172.6741 3180.8666
redmass: 11.8139 5.8156 5.6601 4.2299 6.6070 4.8498 4.2521 4.4749 9.2422 2.1391 1.5009 5.7637 5.1246 4.0324 6.7418 4.2285 9.2105 3.2145 3.2244 2.9976 4.0147 4.1655 4.8675 3.8712 6.4638 6.5413 3.8094 5.3627 1.2635 5.3287 4.7272 1.3879 2.4142 1.8066 2.9432 1.3627 1.7686 1.3068 5.4990 7.4312 2.0687 2.5541 2.8949 2.1752 1.5626 1.7310 1.2695 1.0759 2.2675 1.3158 1.4898 1.4016 1.3554 1.2890 1.3810 7.8405 1.2106 1.0896 2.2492 1.0866 2.3304 1.1024 1.0465 6.3445 7.1042 10.7557 1.0367 1.0593 1.0859 1.0581 1.1047 1.0995 1.1002 1.1063 1.0864 1.0907 1.0947 1.0982
irintensity: 0.8202 1.1743 1.2026 2.5467 2.0530 4.1699 4.1678 0.8121 0.0614 0.7803 0.9569 0.6357 3.9548 2.4705 2.8208 3.8967 3.6183 15.6191 6.6057 5.9597 1.1510 3.4034 10.1868 4.5711 2.9317 25.9384 7.2336 14.1018 114.0181 10.3296 20.6942 3.6712 26.7072 5.7843 39.4336 4.5207 17.3351 0.3644 63.5461 73.9388 36.5144 129.6416 260.0827 4.7160 8.0117 10.4114 32.6147 6.3389 122.1583 40.4117 34.7847 27.8398 4.0036 5.7370 1.5970 12.9561 30.9741 19.9147 19.5868 11.8782 130.8288 15.3614 10.5922 13.4474 43.8776 159.5525 9.5686 40.8311 5.0768 8.7763 6.3762 30.0578 12.6897 1.6446 3.9863 10.3594 10.4422 5.9754
temp: 298.150 k
press: 1.00000 atm
elementType: 17 17 8 8 8 6 6 6 6 6 6 6 6 6 6 6 1 1 1 1 1 1 1 1 1 1 1 1
symmnumber: 1
zpe: 546254.7 jmol-1
zpe.correction: 0.208057 hartree
zpe.thermalcorrener: 0.224749 hartree
zpe.thermalcorrenthalpy: 0.225694 hartree
zpe.thermalcorrgfe: 0.159392 hartree
zpe.sumelectzpe: -1570.945726 hartree
zpe.sumelectthermal: -1570.929034 hartree
zpe.sumelectthermalent: -1570.928090 hartree
zpe.sumelectthermalfe: -1570.994392 hartree
dipole: 0.6712 0.4516 -4.5353
dipole: 4.6069
quadrupole: -124.5197 -94.4722 -109.3366
quadrupole: -9.3559 6.9263 -1.9716
quadrupole: -15.0768 14.9706 0.1062 -9.3559 6.9263 -1.9716
hfenergy: -1571.1537835 hartree
pointgroup: C01 [X(C11H12Cl2O3)]
dipole: 0.6796901 1.2108819 -1.1648663 debye
polarizability: 153.2409203|-20.1303362|128.5817973|5.5070938|19.8480733|149.3291264 unknown
InChI: InChI=1S/C11H12Cl2O3/c1-8(16-11(14)6-12)7-15-10-5-3-2-4-9(10)13/h2-5,8H,6-7H2,1H3
charge 0 multiplicity 1
28 atoms
Cl 2.66444 -0.024146 3.132087
Cl -3.355384 -2.602059 -2.21891
O  0.759628 1.214901 1.2507
O  -1.444286 0.618725 -0.760746
O  -3.258599 -0.561986 0.129373
C  -1.525164 1.628384 0.351637
C  -0.106249 2.169923 0.544335
C  -2.53359 2.719637 -0.032281
C  1.679614 0.428256 0.547423
C  2.662275 -0.2374 1.327985
C  1.697348 0.246709 -0.858799
C  -2.354098 -0.446005 -0.715313
C  3.638664 -1.055977 0.734767
C  2.683435 -0.568467 -1.458577
C  3.6554 -1.221806 -0.670083
C  -1.986012 -1.404734 -1.841152
H  -1.852698 1.094246 1.262134
H  0.336662 2.487396 -0.418226
H  -0.158045 3.04418 1.216918
H  -3.529911 2.27558 -0.189927
H  -2.618387 3.463541 0.780421
H  -2.227061 3.24196 -0.95594
H  0.924074 0.710614 -1.475963
H  4.380155 -1.552026 1.368137
H  2.682728 -0.695166 -2.546611
H  4.417629 -1.855824 -1.133217
H  -1.106667 -1.999135 -1.545757
H  -1.762701 -0.848023 -2.762113
