program: Gaussian 09
title: 000246039
version: EM64L-G09RevD.01
frameworkgroup: C1[X(C9H6N2O3)]
method: RPBEPBE
basis: SDD
operation: Freq
keyword: #pfreq=noraman
keyword: PBEPBE/SDD
title: #p freq=noraman PBEPBE/SDD
converged: NO YES NO YES
title: Mulliken charges:
elementType: O O O N N C C C C C C C C C H H H H H H
charge: -0.212878 -0.209433 -0.208085 -0.394102 0.018458 0.222442 0.254066 0.214078 -0.542081 -0.301150 -0.303888 0.395943 -0.366690 -0.200078 0.297195 0.327269 0.246346 0.296901 0.289681 0.176006
chargesum: 0.00000
title: Mulliken charges with hydrogens summed into heavy atoms:
elementType: O O O N N C C C C C C C C C
charge: -0.212878 -0.209433 -0.208085 -0.066833 0.018458 0.222442 0.254066 0.214078 -0.244886 -0.054804 -0.006988 0.395943 -0.077009 -0.024072
polarizability: 2.01713707e+02 -4.85803338e+00 1.42088399e+02 5.76377051e-03 -4.90309187e-03 4.60259595e+01
1716.lowfreq: -11.2974 -8.6499 -3.8490 0.0002 0.0004 0.0009 54.5125 102.3310 107.9002
frequency: 54.5021 102.3282 107.8989 113.9497 204.3136 220.8160 274.6494 327.3875 334.7360 344.9264 425.5887 468.3528 532.9603 564.4238 601.0484 605.0224 635.3403 671.3433 705.8988 737.0503 768.9986 775.8203 825.2587 830.0137 863.4620 904.3975 937.8836 973.4652 977.6174 1033.1598 1087.4931 1104.4796 1135.5041 1214.1586 1236.6711 1255.0167 1291.1635 1306.0206 1366.0292 1376.4968 1408.6711 1428.3561 1472.2374 1480.1866 1536.1386 1583.7880 1607.8085 1630.8029 2899.0203 3155.7446 3182.7120 3190.7305 3241.5522 3597.1393
redmass: 15.0578 5.4607 6.3459 9.6290 2.6661 7.5522 5.1329 10.9048 4.2910 8.3556 2.8636 7.9502 4.9003 4.4119 7.5600 1.8413 1.7106 8.7462 5.3792 5.3637 8.8537 3.8433 5.2678 1.5933 1.3784 4.9147 1.4979 1.3647 1.7748 2.4207 2.8907 1.6725 1.2322 9.9345 1.5504 2.5392 2.1374 3.3912 2.4259 3.4555 2.7951 2.4807 5.2903 5.0224 5.6464 7.2631 6.2919 7.4600 1.0848 1.0909 1.0928 1.0952 1.0994 1.0812
irintensity: 0.8215 1.3756 1.2010 5.3149 11.4407 0.6316 5.2120 6.6652 12.6992 2.9862 14.4052 2.0246 8.2263 0.0284 2.9078 65.4550 38.7981 23.4491 29.3518 25.6932 21.3354 0.1840 12.3122 51.0746 12.2266 0.3590 26.3371 0.5146 1.4673 8.4084 47.1945 24.8488 17.0595 386.1233 28.3964 6.7803 16.0843 12.6763 18.8956 231.5221 18.4096 4.2387 13.1577 6.5419 147.0368 94.3094 186.0423 21.6356 76.1991 6.1543 2.3951 5.1550 4.4162 89.9222
temp: 298.150 k
press: 1.00000 atm
elementType: 8 8 8 7 7 6 6 6 6 6 6 6 6 6 1 1 1 1 1 1
symmnumber: 1
zpe: 363129.6 jmol-1
zpe.correction: 0.138309 hartree
zpe.thermalcorrener: 0.149284 hartree
zpe.thermalcorrenthalpy: 0.150228 hartree
zpe.thermalcorrgfe: 0.100690 hartree
zpe.sumelectzpe: -680.680711 hartree
zpe.sumelectthermal: -680.669736 hartree
zpe.sumelectthermalent: -680.668792 hartree
zpe.sumelectthermalfe: -680.718330 hartree
dipole: 2.8900 6.8046 -0.0017
dipole: 7.3929
quadrupole: -106.9145 -69.9238 -81.0968
quadrupole: 9.8435 -0.0106 0.0031
quadrupole: -20.9361 16.0545 4.8816 9.8435 -0.0106 0.0031
hfenergy: -680.8190202 hartree
pointgroup: C01 [X(C9H6N2O3)]
dipole: -1.128211 -2.6808624 -0.0006675 debye
dipolederiv: -1.1328192 0.5677692 -0.0002355 0.2900547 -0.6198769 0.0000219 0.0009919 -0.0005717 -0.3391312 -0.9936045 0.0991713 -0.0000095 0.0852244 -0.4906226 0.0000165 0.0000417 -0.0000159 -0.2307855 -0.5687478 -0.0984069 0.0000145 -0.2636107 -0.8331272 -0.0000313 0.0000218 0.0000473 -0.2291924 -0.8120778 0.27023 0.0000004 -0.0436826 -0.6436821 -0.0000796 -0.0000565 -0.0000044 -0.252635 1.8619739 0.2281356 -0.0000194 0.4895778 1.210929 0.0000126 -0.0000219 -0.0000115 0.1874489 0.2369118 -0.2674845 0.0000501 -0.46712 -0.1995292 -0.0000346 0.0000048 0.0001374 0.0130478 0.6810802 0.0067643 0.0000138 0.590762 -0.0271615 0.000014 -0.0000542 0.0000182 0.0422043 -0.1269495 -0.0180294 0.0000561 0.5760033 -0.9133654 -0.0001307 -0.0001312 0.0000812 -0.0705952 0.3053361 0.2410907 -0.0000043 -0.0666098 -0.0169006 -0.0000105 -0.000002 0.0000342 -0.1061975 -0.2229224 -0.0393454 0.0000008 -0.0643832 0.1355534 -0.0000066 -0.0000188 -0.000025 -0.1513203 -0.0823855 -0.1259589 0.0000038 -0.3782889 0.7480875 0.0000038 0.0000017 0.0000631 -0.0687753 -0.7267108 -0.2790832 0.0000059 -0.3121761 -0.0384511 0.0000012 -0.0000267 -0.0000437 0.0547107 -0.0299599 -0.0077275 0.0000174 0.2859639 0.014653 -0.0000084 -0.0000143 -0.0000022 -0.1370782 1.1695437 -0.484463 0.0002122 -0.709246 1.3291592 0.0003391 -0.0005209 0.000677 0.1183197 0.1332914 0.0155825 -0.0000009 0.0211184 0.0513896 0.0000017 -0.0000196 0.0000046 0.1696304 0.1831139 0.0681808 0.0000034 0.0525445 0.2427259 0.0000085 0.0000216 0.000002 0.3435589 0.0764158 -0.0245688 -0.0000024 -0.000727 -0.0763486 0.0000067 0.0000273 0.0000042 0.1728004 0.0641146 -0.0157775 -0.0000054 -0.0212868 0.1062103 -0.0000071 -0.0000305 -0.0000027 0.2008712 0.0673681 0.0611498 -0.0000138 0.0133083 0.1156307 0.000004 -0.000009 0.0000034 0.1768626 -0.0829721 -0.1972291 -0.0000873 -0.0774261 -0.0952734 -0.0001215 -0.000205 -0.0003956 0.1062558 unknown
polarizability: 201.7449454|-4.6622842|142.0571603|-0.0057798|0.0048842|46.0259595 unknown
InChI: InChI=1S/C9H6N2O3/c12-5-6-4-10-9-2-1-7(11(13)14)3-8(6)9/h1-5,10H
charge 0 multiplicity 1
20 atoms
O  -3.930759 1.921735 0.0012
O  4.10642 0.125009 -0.000077
O  2.932844 2.079822 -0.000061
N  -1.928135 -1.919294 -0.000175
N  2.998603 0.789745 0.000036
C  -0.681117 -0.004583 -0.000165
C  -0.608974 -1.443146 -0.000111
C  -2.095715 0.353586 -0.000336
C  0.516536 0.743925 -0.000089
C  0.613949 -2.148892 -0.000008
C  -2.816009 -0.850758 -0.00025
C  1.728025 0.02555 0.000048
C  1.798658 -1.396318 0.000055
C  -2.686937 1.69273 -0.000524
H  0.539812 1.836347 -0.000115
H  -2.194686 -2.902643 -0.000167
H  0.648261 -3.242543 0.000028
H  -3.895263 -0.988118 -0.000315
H  2.781083 -1.874051 0.00013
H  -1.956598 2.537896 0.000993
