program: Gaussian 09
title: 000246046
version: EM64L-G09RevD.01
frameworkgroup: C1[X(C10H8ClN3O3)]
method: RPBEPBE
basis: SDD
operation: Freq
keyword: #p
keyword: freq=noraman
keyword: PBEPBE/SDD
title: #p freq=noraman PBEPBE/SDD
converged: YES YES NO NO
title: Mulliken charges:
elementType: Cl O O O N N N C C C C C C C C C C H H H H H H H H
charge: -0.065911 -0.198638 -0.172728 -0.210501 -0.433852 -0.366543 -0.374983 -0.282116 0.205702 0.127093 0.495556 0.195023 -0.417249 -0.343681 -0.182605 -0.206834 -0.124306 0.295831 0.307718 0.371717 0.374774 0.224568 0.274263 0.253774 0.253927
chargesum: 0.00000
title: Mulliken charges with hydrogens summed into heavy atoms:
elementType: Cl O O O N N N C C C C C C C C C C
charge: -0.065911 -0.198638 -0.172728 -0.210501 -0.126134 0.005174 -0.000209 0.013715 0.205702 0.127093 0.495556 0.195023 -0.192681 -0.069418 0.071169 0.047093 -0.124306
polarizability: 2.41474078e+02 -4.61361587e+00 1.21711733e+02 -1.37782162e+01 1.14908028e+01 9.66296965e+01
1716.lowfreq: -2.0975 0.0019 0.0024 0.0034 2.6920 11.6207 20.0938 38.8993 49.2757
frequency: 19.9565 38.8958 49.2629 85.8086 123.9725 137.0372 144.9611 182.6278 219.1421 268.5714 308.2822 336.7908 354.1583 357.7297 374.4170 411.4659 450.5030 465.2236 496.4967 511.2152 570.3761 606.8875 613.6084 628.9611 662.1904 685.5649 696.4810 724.7378 756.3770 792.7034 804.0776 819.1489 836.4565 905.3929 928.3596 938.1593 949.4867 985.0489 989.7113 1074.8787 1090.2062 1125.6369 1190.8169 1206.3431 1269.8053 1280.1947 1294.9747 1305.0885 1314.5353 1346.8732 1367.4961 1376.7907 1379.7154 1408.7002 1476.4355 1494.3539 1591.0519 1611.7218 1634.3836 1661.4550 1677.6779 3038.1419 3126.2160 3154.9851 3170.4832 3174.9579 3512.5591 3515.0812 3561.8388
redmass: 11.8364 9.8615 4.4194 8.9001 7.0688 8.0590 10.9692 9.2496 6.6486 5.1427 2.7157 3.0502 10.2021 3.5257 5.3717 2.9966 6.2105 9.4119 3.2717 4.8662 4.6790 8.1358 6.2554 6.2576 3.2467 2.8394 3.4096 6.5242 1.6267 1.6897 1.3387 1.5293 5.4904 4.5157 1.5126 2.3475 1.5402 3.3620 4.0460 3.1479 3.2128 1.4911 1.1262 5.9000 1.5521 1.6688 2.2421 1.4825 1.9181 8.8840 3.7394 1.7177 1.6779 3.7708 1.7399 2.1807 5.4716 6.2719 6.8363 9.6777 5.4825 1.0842 1.0898 1.0887 1.0953 1.0970 1.0759 1.0782 1.0771
irintensity: 0.1833 0.6917 0.3042 0.7435 3.0287 0.0553 8.6130 2.7018 1.2151 3.6371 10.4514 14.4632 17.5615 52.3256 49.3150 0.2897 13.3856 12.4082 26.0254 17.2312 8.9911 9.3780 23.7217 12.9543 17.4028 21.4538 1.0056 10.0667 7.6889 221.0145 25.4854 74.2002 5.6682 12.8630 0.4456 1.4976 0.4594 5.6058 25.6835 51.3067 6.9769 17.9458 7.2117 85.8904 44.7925 37.9060 325.7756 59.1980 89.0236 254.2381 25.8162 7.9416 3.4124 3.9656 29.3624 311.0753 1.3612 75.0011 316.0891 105.0894 626.7695 9.2157 13.2958 2.3401 4.7816 0.3055 91.9902 53.5689 25.6457
temp: 298.150 k
press: 1.00000 atm
elementType: 17 8 8 8 7 7 7 6 6 6 6 6 6 6 6 6 6 1 1 1 1 1 1 1 1
symmnumber: 1
zpe: 458550.4 jmol-1
zpe.correction: 0.174653 hartree
zpe.thermalcorrener: 0.189506 hartree
zpe.thermalcorrenthalpy: 0.190450 hartree
zpe.thermalcorrgfe: 0.130502 hartree
zpe.sumelectzpe: -1234.677046 hartree
zpe.sumelectthermal: -1234.662192 hartree
zpe.sumelectthermalent: -1234.661248 hartree
zpe.sumelectthermalfe: -1234.721197 hartree
dipole: 2.7931 -0.8374 -1.1345
dipole: 3.1289
quadrupole: -122.1957 -108.3364 -104.7549
quadrupole: 1.2675 3.6384 8.4422
quadrupole: -10.4334 3.4259 7.0074 1.2675 3.6384 8.4422
hfenergy: -1234.8516985 hartree
pointgroup: C01 [X(C10H8Cl1N3O3)]
dipole: 1.0693446 0.2393684 0.5608791 debye
dipolederiv: -0.9031658 -0.1703176 -0.063074 -0.1873039 -0.1166045 -0.0312372 -0.0832949 -0.0355537 -0.1313637 -0.6469294 -0.0926009 -0.1605877 -0.0001276 -0.7005532 -0.3554637 -0.205072 -0.2649792 -0.5748803 -0.5998814 0.1065307 -0.0840238 0.0786451 -1.0687691 0.1230744 -0.1095309 0.0279089 -0.3263323 -1.2254721 0.1071779 -0.3080414 0.1339416 -0.5905694 0.0147056 -0.3952996 0.0044182 -0.5082014 -1.6848013 -0.158142 0.0138874 -0.1437451 -0.4739414 0.0792866 -0.0187832 -0.0367121 -0.2053994 -1.3485226 -0.4461018 -0.4301089 -0.1254746 -0.5941655 -0.1598965 -0.5835352 -0.2871843 -0.5812912 -1.0765561 0.6489342 -0.1578724 0.3435629 -0.9760867 0.091319 -0.3032316 0.1795596 -0.3900977 0.3071802 -0.0708277 -0.1828073 -0.2198055 0.0347939 -0.0595077 -0.416158 -0.1545639 0.2941727 1.3927813 0.1409258 0.5173709 -0.3255862 0.6346151 0.3183807 0.5713466 0.459636 0.6494236 1.3716723 -0.3865509 0.3639371 -0.0090238 1.2157667 -0.1778943 0.5585982 -0.2115893 0.2982059 1.6980867 0.2747699 0.0603377 0.3761758 0.1300799 -0.0590879 0.3855944 0.0513852 -0.0632012 1.7318271 -0.081465 0.5131335 -0.0683563 1.7110577 0.2025326 0.7511314 0.2383873 0.6709367 -0.3821463 -0.0405055 -0.0685589 -0.0028922 -0.1795703 0.0760318 0.1794395 0.1270956 0.0435631 -0.3106543 -0.0177683 0.0546978 -0.1338306 -0.1739308 0.1072076 -0.3243357 -0.0062861 -0.0555082 -0.1274132 -0.0057121 0.0274165 -0.0331328 -0.0578044 0.068374 -0.0503021 0.0407628 0.066675 -0.084744 -0.0319316 -0.0973117 0.0202113 -0.062979 0.0461186 0.0121749 0.0579007 0.0674826 1.0968604 0.2634438 0.1305197 0.2805339 -0.0412044 0.0333818 0.1508235 0.0462856 -0.0547363 0.097871 0.0374903 -0.0740727 0.0176784 0.0638453 -0.0027598 0.0371025 0.0239606 0.0041679 0.0787354 -0.0414708 0.0353326 0.0334896 0.2774475 -0.0450783 0.0124643 -0.0200484 0.1331118 0.2033836 -0.0031122 -0.0734739 -0.0161246 0.2396454 -0.040313 -0.140361 -0.0565979 0.2815919 0.2115136 0.0412148 -0.0465078 0.0839171 0.1967632 0.0075028 -0.078813 0.017633 0.3170347 0.0295207 -0.0567538 -0.08167 -0.0513869 0.1133141 -0.0966208 -0.0608198 -0.0803222 -0.0280383 0.0681142 0.005763 0.0691082 -0.018188 0.1384686 -0.0437422 0.0801551 -0.0197321 0.0623395 0.0244543 0.0031952 0.0805127 0.0050924 0.1523475 -0.0299845 0.0758542 -0.0354405 0.0255255 0.0782856 -0.0261856 -0.0381437 -0.0382699 0.1280342 -0.0663297 -0.0451477 -0.0659238 0.0048187 unknown
polarizability: 239.0868491|16.6437265|108.8365009|13.2342485|18.9079724|111.8921577 unknown
InChI: InChI=1S/C10H8ClN3O3/c11-5-1-3-6(4-2-5)12-7-8(15)13-10(17)14-9(7)16/h1-4,7,12-14H
charge 0 multiplicity 1
25 atoms
Cl -5.82429 -1.095439 -0.186628
O  1.224976 -1.746806 -1.572861
O  1.588273 2.854258 -0.247755
O  4.863568 -0.247345 0.916645
N  0.032474 0.273752 0.54242
N  2.973906 -1.018783 -0.226907
N  3.172862 1.271862 0.369612
C  0.995514 0.480365 -0.542292
C  1.72851 -0.844024 -0.860478
C  1.924879 1.649522 -0.162131
C  -1.324559 -0.060856 0.341995
C  3.743809 -0.022255 0.400505
C  -2.244816 0.144422 1.40863
C  -1.795537 -0.6094 -0.882677
C  -3.607888 -0.175141 1.253547
C  -3.16466 -0.912317 -1.04389
C  -4.055615 -0.69206 0.021897
H  0.453084 0.780203 -1.457125
H  0.311191 0.559027 1.481369
H  3.414012 -1.943165 -0.292054
H  3.775839 2.021211 0.727092
H  -1.898835 0.569845 2.358498
H  -1.098319 -0.852627 -1.689619
H  -4.310722 -0.011178 2.075406
H  -3.523455 -1.33597 -1.986401
