program: Gaussian 09
title: 000246011
version: EM64L-G09RevD.01
frameworkgroup: C1[X(C7H8Cl2N2)]
method: RPBEPBE
basis: SDD
operation: Freq
keyword: #p
keyword: freq=noraman
keyword: PBEPBE/SDD
title: #p freq=noraman PBEPBE/SDD
converged: YES YES NO NO
title: Mulliken charges:
elementType: Cl Cl N N C C C C C C C H H H H H H H H
charge: 0.005555 0.026478 0.060567 0.150987 -0.470296 -0.357144 0.288683 -0.679422 -0.279511 -0.165138 -0.392049 0.232349 0.208409 0.207638 0.237098 0.216201 0.210999 0.227555 0.271039
chargesum: 0.00000
title: Mulliken charges with hydrogens summed into heavy atoms:
elementType: Cl Cl N N C C C C C C C
charge: 0.005555 0.026478 0.060567 0.150987 -0.029538 0.087592 0.288683 -0.024666 -0.008472 -0.165138 -0.392049
polarizability: 1.37594714e+02 3.62371397e+00 1.32678551e+02 6.57088643e+00 -1.32336820e+00 5.85217826e+01
1716.lowfreq: -6.5880 -0.0020 0.0012 0.0018 3.5656 5.5983 30.7865 77.7854 82.1022
frequency: 30.6342 77.7773 82.0899 150.2599 163.1552 186.4374 231.2790 243.2496 270.7597 296.9721 375.0028 421.1373 458.1673 558.8562 598.7041 657.6326 744.4260 767.5067 774.1400 858.7054 873.3472 898.8348 912.0383 922.5760 1052.6508 1077.4222 1088.6434 1106.8461 1209.9714 1230.2119 1264.5435 1265.3743 1281.1904 1309.1716 1334.6080 1350.4489 1394.2232 1459.6843 1476.1878 1478.7868 1485.9577 1498.8851 1520.6307 2978.0222 2987.9192 3000.5558 3039.6914 3064.3714 3080.7649 3081.7018 3197.0820
redmass: 3.3118 2.3602 2.9263 6.3985 9.3758 14.8967 1.5303 1.8866 4.5331 3.8258 13.9337 10.0940 4.8252 4.9436 7.0128 8.2121 1.1568 5.0796 6.9818 1.8531 1.4392 1.9874 2.9523 5.3562 2.9316 1.5210 2.1122 1.8720 2.0179 3.2341 5.1556 1.6946 1.2024 1.9828 1.4715 3.8276 1.2100 1.1205 1.0528 1.0494 1.1005 6.0103 7.3935 1.0358 1.0610 1.0593 1.0990 1.1025 1.1000 1.1021 1.0949
irintensity: 0.1603 0.1194 0.2523 4.1543 0.3589 0.2145 0.4677 0.4915 1.0314 0.3899 3.8407 11.1270 2.3400 11.4083 1.9811 6.3885 0.4591 6.5467 150.5636 21.0871 3.4599 16.3868 6.2341 14.1255 2.3815 10.6551 46.8886 14.7836 44.4062 132.9915 54.7420 23.3764 4.8686 93.6049 13.5155 4.8351 8.3387 16.5253 1.2722 5.2682 27.7260 307.2606 337.8630 37.1019 9.1710 33.4543 0.1293 0.3534 47.4036 61.4562 0.2501
temp: 298.150 k
press: 1.00000 atm
elementType: 17 17 7 7 6 6 6 6 6 6 6 1 1 1 1 1 1 1 1
symmnumber: 1
zpe: 364078.9 jmol-1
zpe.correction: 0.138670 hartree
zpe.thermalcorrener: 0.149814 hartree
zpe.thermalcorrenthalpy: 0.150758 hartree
zpe.thermalcorrgfe: 0.099675 hartree
zpe.sumelectzpe: -1300.338994 hartree
zpe.sumelectthermal: -1300.327851 hartree
zpe.sumelectthermalent: -1300.326907 hartree
zpe.sumelectthermalfe: -1300.377989 hartree
dipole: 3.7498 -2.7535 0.4476
dipole: 4.6737
quadrupole: -80.5162 -80.7680 -78.1723
quadrupole: -1.9959 -0.5475 -0.9741
quadrupole: -0.6974 -0.9492 1.6466 -1.9959 -0.5475 -0.9741
hfenergy: -1300.4776647 hartree
pointgroup: C01 [X(C7H8Cl2N2)]
dipole: -1.5758281 -0.8916601 -0.3205959 debye
dipolederiv: -0.4400759 0.4354214 -0.0014285 0.4216878 -0.6669746 -0.0097767 -0.0160382 0.0100034 -0.0710537 -0.2328359 -0.2898404 -0.0654791 -0.3185364 -0.7631856 -0.143488 -0.0775939 -0.1547708 -0.0928294 -0.9541741 -0.469119 -0.1863268 -0.210727 -0.7147414 -0.0792459 -0.1889165 -0.1649205 -0.2012346 -0.464854 0.0888241 -0.0452992 0.0258237 -1.4453741 -0.1632385 -0.0740657 -0.1651478 -0.1343333 -0.3837833 0.0147338 0.0468244 0.1566712 0.1193966 0.0201562 0.2486173 -0.0052106 0.0117371 0.1053826 -0.0113452 -0.0380279 -0.0748421 0.1340273 -0.0325467 -0.2976706 -0.0236615 0.1191607 1.0419464 0.0624952 0.107007 -0.1978272 0.5646005 0.0112531 0.1879738 0.0815707 0.0477911 -0.0712415 0.0070614 0.0049943 0.0286734 0.1034136 -0.0012912 0.1239275 -0.0047892 0.0508256 -0.830385 0.3143769 -0.059557 0.3455457 -0.3765762 0.0072373 -0.1314285 0.0142973 -0.0595306 1.0776423 -0.5414272 0.0982778 -0.5194891 1.4809646 0.0970293 0.1320013 0.0810713 0.0872464 0.9051801 0.4311383 0.2137431 0.4604005 1.7987046 0.2925628 0.2395416 0.3281087 0.1333813 0.0436404 0.0224698 -0.0387073 0.0015864 0.0022256 0.1081981 -0.0497333 0.063768 -0.0039915 0.0326053 -0.0132302 -0.0095168 -0.0507363 -0.0965359 -0.1142471 -0.020128 -0.0628536 0.0342418 0.0169206 0.0621332 -0.0365673 0.0466437 -0.040686 0.1346795 -0.0118287 0.0911438 -0.0534876 0.0364061 -0.0646702 -0.0252358 -0.0521524 -0.0598511 -0.0943731 -0.0228097 -0.0587689 0.0319158 0.0557335 0.0100526 -0.0215596 0.0557731 -0.0430228 0.1270424 -0.0810476 0.1268537 -0.0232276 0.0437562 -0.0265242 -0.0236782 -0.0961586 -0.1132067 -0.0980502 -0.0725183 -0.0941634 0.0491422 -0.0811193 0.0215665 0.1056619 0.0323388 0.0976433 -0.0341333 0.1362632 -0.033155 -0.0767006 0.0992555 -0.0541169 -0.0251251 -0.0546754 0.0191783 -0.0277679 -0.0245457 -0.0293756 0.1509469 unknown
polarizability: 136.5158191|-5.0553659|132.1574959|7.5737056|9.8536742|60.1217327 unknown
InChI: InChI=1S/C7H8Cl2N2/c1-2-3-5-4-6(8)11-7(9)10-5/h4H,2-3H2,1H3
charge 0 multiplicity 1
19 atoms
Cl 2.741721 -2.533653 -0.01761
Cl 1.978167 2.76294 0.541911
N  -0.031149 1.09203 -0.107414
N  2.157514 0.098715 0.218117
C  -2.039091 -0.207493 -0.677212
C  -2.891524 0.036238 0.602858
C  -0.559657 -0.150291 -0.387772
C  -4.401781 0.046404 0.290508
C  0.264071 -1.30509 -0.370713
C  1.624572 -1.104471 -0.056955
C  1.282735 1.134164 0.175554
H  -2.284904 0.579935 -1.414365
H  -2.301761 -1.185298 -1.121195
H  -2.665122 -0.750105 1.349527
H  -2.584923 1.00129 1.047276
H  -4.653302 0.849733 -0.426759
H  -4.728521 -0.914618 -0.149302
H  -4.993183 0.215794 1.208116
H  -0.134563 -2.296225 -0.591668
