program: Gaussian 09
title: 000246004
version: EM64L-G09RevD.01
frameworkgroup: C1[X(C6H7ClN2O2)]
method: RPBEPBE
basis: SDD
operation: Freq
keyword: #p
keyword: freq=noraman
keyword: PBEPBE/SDD
title: #p freq=noraman PBEPBE/SDD
converged: YES YES NO NO
title: Mulliken charges:
elementType: Cl O O N N C C C C C C H H H H H H H
charge: -0.001653 -0.219673 -0.240556 -0.416727 -0.389732 0.510834 -0.498818 -0.371746 -0.650500 0.246182 0.140833 0.216034 0.258391 0.350065 0.234056 0.218424 0.245142 0.369444
chargesum: 0.00000
title: Mulliken charges with hydrogens summed into heavy atoms:
elementType: Cl O O N N C C C C C C
charge: -0.001653 -0.219673 -0.240556 -0.066662 -0.020287 0.510834 -0.024393 -0.371746 0.047121 0.246182 0.140833
polarizability: 1.15545070e+02 7.78670518e+00 1.15542825e+02 -1.99586436e+00 4.98690598e+00 5.04861283e+01
1716.lowfreq: -10.9005 -2.5745 -0.0013 0.0022 0.0023 10.8869 42.4153 79.9059 116.2900
frequency: 42.2588 79.8907 116.2795 165.1336 195.2724 221.1074 264.4774 302.4345 308.2270 346.6739 391.2802 493.1105 561.1550 594.4533 620.4502 629.3530 652.7669 704.7905 723.1294 772.9915 787.1812 914.3421 973.6278 1018.3414 1055.2511 1072.4783 1097.5813 1178.8735 1234.6576 1278.2715 1313.3338 1354.1041 1371.9996 1394.7976 1446.1639 1471.5495 1475.6120 1487.0448 1613.2938 1644.0368 1681.7708 2993.1602 2998.5589 3071.4362 3094.6935 3102.5661 3528.7710 3552.1256
redmass: 2.7811 9.3513 4.8737 7.1721 1.1911 6.0279 5.3347 3.0700 5.6394 9.5051 8.1142 5.7355 7.4143 4.2772 1.2726 3.6399 4.9642 2.3583 5.3981 2.4866 1.2127 3.0980 3.0864 3.5876 2.8709 2.3794 1.8513 7.0491 1.5533 1.8915 1.4189 2.3793 1.9778 1.1903 2.7653 1.0706 1.0531 1.0829 7.0750 7.7515 5.5748 1.0353 1.0648 1.0975 1.1000 1.1016 1.0772 1.0780
irintensity: 0.1088 0.1578 0.8906 3.6052 0.0152 0.6597 0.4761 0.6651 2.9986 9.9792 7.4035 7.6067 9.5789 0.7525 60.4751 27.7674 23.7301 6.0451 18.6997 151.9825 8.8807 1.3058 5.9747 19.6032 43.2511 56.8980 5.1013 1.7053 14.1989 25.6331 1.9507 59.3555 56.9052 11.0854 26.5517 5.6844 12.2046 21.0231 12.1756 457.0617 679.4138 25.9289 26.2108 0.6783 30.3188 23.3983 67.8758 72.7807
temp: 298.150 k
press: 1.00000 atm
elementType: 17 8 8 7 7 6 6 6 6 6 6 1 1 1 1 1 1 1
symmnumber: 1
zpe: 343273.6 jmol-1
zpe.correction: 0.130746 hartree
zpe.thermalcorrener: 0.141303 hartree
zpe.thermalcorrenthalpy: 0.142247 hartree
zpe.thermalcorrgfe: 0.093658 hartree
zpe.sumelectzpe: -952.065828 hartree
zpe.sumelectthermal: -952.055272 hartree
zpe.sumelectthermalent: -952.054328 hartree
zpe.sumelectthermalfe: -952.102916 hartree
dipole: 2.4834 -4.7281 -0.6483
dipole: 5.3798
quadrupole: -78.1443 -75.6668 -70.4809
quadrupole: -9.3480 -0.3685 0.5795
quadrupole: -3.3803 -0.9028 4.2831 -9.3480 -0.3685 0.5795
hfenergy: -952.1965744 hartree
pointgroup: C01 [X(C6H7Cl1N2O2)]
dipole: -1.5688021 -1.4014167 0.2342037 debye
dipolederiv: -0.3199293 0.2954687 0.0234085 0.2116094 -0.3292675 -0.0148016 0.0177482 -0.0181851 -0.0267624 -0.6101906 -0.3435899 0.0483214 -0.2539941 -1.1005944 0.0788871 0.0569375 0.1107684 -0.3652797 -0.989826 0.5087638 0.0314585 0.4990724 -0.9912535 -0.0102271 0.046115 -0.0228195 -0.3880492 -1.098193 0.6529713 0.0388234 -0.0784031 -0.7047853 0.0348466 0.1088698 -0.0813656 -0.2931241 -0.5078581 0.2489326 -0.0121148 0.2600431 -1.1791814 0.0398743 0.0017202 0.0285724 -0.35351 0.4731414 -0.2035234 0.0171677 0.1298 0.9331811 -0.0492951 -0.0450072 0.0086476 0.03965 -0.1051613 0.0109091 -0.0230472 -0.0513658 0.0951331 -0.0354854 -0.133048 -0.1476839 0.0693192 -0.1789219 -0.9077119 0.0300808 -0.6463558 -0.0400016 0.0598408 0.0704566 0.1172875 -0.1613747 0.0217657 -0.0444013 -0.0182343 -0.0326443 0.0397545 0.0135718 0.1052518 0.0896682 0.025808 1.177104 0.3203476 -0.1072621 0.2315059 1.4608926 -0.110011 -0.1400128 -0.1343707 0.3293318 1.6590501 -0.6380641 -0.1190188 -0.3698419 1.477987 -0.054518 -0.1658689 0.0042357 0.3469103 0.0403271 0.023361 -0.0525797 -0.0086773 -0.0764077 0.1318406 -0.0120282 0.1026621 -0.0006901 0.0322915 0.0106685 0.0297547 0.0606958 0.0205893 -0.104495 0.0300605 -0.0437209 0.0359053 0.1809245 0.0332413 0.0280509 0.0077512 0.2401285 0.0006147 0.0329971 0.002002 0.3110123 -0.152054 -0.1141953 0.0120717 -0.0998463 0.0664826 -0.0008483 0.0051378 -0.0158372 0.0664535 0.0321766 0.1144779 0.0647649 0.0698652 -0.014744 -0.1022818 0.0213204 -0.0723882 0.0059559 0.111763 -0.0039351 -0.0073864 0.0340988 -0.0430235 0.1114704 -0.0148618 0.063672 0.0170167 0.2335904 0.0362793 0.0157406 0.0366867 0.1451101 0.0110172 0.0142119 0.0088552 0.3414272 unknown
polarizability: 110.4005313|-5.8011134|120.7878038|-3.8317835|-2.7630022|50.3856884 unknown
InChI: InChI=1S/C6H7ClN2O2/c1-2-3-4(7)5(10)9-6(11)8-3/h8-9H,2H2,1H3
charge 0 multiplicity 1
18 atoms
Cl -1.694016 2.214271 0.195452
O  1.355591 2.491374 -0.252153
O  2.398035 -2.074463 -0.039355
N  0.171321 -1.398207 0.236561
N  1.83506 0.20855 -0.139552
C  -0.824498 -0.417641 0.305758
C  -2.238879 -0.913429 0.512767
C  -0.460141 0.903263 0.14008
C  -2.95652 -1.204232 -0.834532
C  0.931157 1.31699 -0.095613
C  1.542131 -1.153597 0.011376
H  -2.219662 -1.829205 1.135172
H  -2.808079 -0.151107 1.070436
H  -0.075903 -2.382068 0.363022
H  -3.97752 -1.578874 -0.645473
H  -2.416104 -1.963729 -1.427421
H  -3.033833 -0.28513 -1.4399
H  2.819859 0.441936 -0.301525
