program: Gaussian 09
title: 000245954
version: EM64L-G09RevD.01
frameworkgroup: C1[X(C12H16ClNO2)]
method: RPBEPBE
basis: SDD
operation: Freq
keyword: #p
keyword: freq=noraman
keyword: PBEPBE/SDD
title: #p freq=noraman PBEPBE/SDD
converged: YES YES NO NO
title: Mulliken charges:
elementType: Cl O O N C C C C C C C C C C C C H H H H H H H H H H H H H H H H
charge: -0.069575 -0.349858 -0.280244 -0.472623 0.379291 -0.396309 -0.726090 -0.738776 -0.707537 0.287667 0.498013 -0.440053 -0.367381 -0.039624 -0.187499 -0.260637 0.255908 0.199031 0.212510 0.266507 0.221759 0.207561 0.226551 0.238051 0.219575 0.228613 0.215911 0.332529 0.252754 0.304865 0.231953 0.257156
chargesum: 0.00000
title: Mulliken charges with hydrogens summed into heavy atoms:
elementType: Cl O O N C C C C C C C C C C C C
charge: -0.069575 -0.349858 -0.280244 -0.140094 0.379291 0.058631 -0.025314 -0.066613 -0.043438 0.287667 0.498013 -0.187299 -0.062516 -0.039624 0.044454 -0.003481
polarizability: 2.34704416e+02 -2.79780708e+00 1.49133885e+02 5.89485128e+00 2.56829085e+00 9.50482673e+01
1716.lowfreq: -5.4543 -2.8199 0.0021 0.0025 0.0025 8.2257 24.0702 38.1902 67.5675
frequency: 23.9708 38.0150 67.5663 75.6326 78.2954 134.3654 159.4827 183.5589 192.0613 208.3299 219.9564 234.8107 246.4548 260.4673 276.9974 331.5728 335.9004 361.3059 400.5190 409.6857 435.9654 438.5576 503.7891 560.5581 580.8578 645.3746 662.0504 684.2386 701.0336 705.2513 746.6690 776.5656 787.2906 815.6846 861.6037 870.1425 907.0996 917.2394 929.3145 978.1329 987.5732 990.3265 999.3341 1011.4703 1059.3582 1071.5571 1072.9708 1096.4598 1139.4616 1178.3367 1182.0843 1214.9092 1244.9770 1251.3468 1300.4320 1308.5732 1350.7768 1372.5577 1376.6854 1393.5102 1395.7488 1411.6497 1450.1361 1463.3351 1468.2824 1471.6719 1475.3549 1482.0928 1487.0917 1496.7516 1509.0871 1583.5353 1614.2110 1649.6409 2987.0527 2988.6778 2991.6911 2997.3230 3057.9716 3081.7610 3082.8378 3087.6877 3095.0247 3104.7030 3114.5628 3145.7985 3147.9078 3180.0091 3197.1211 3543.6164
redmass: 4.5834 3.7728 3.0970 5.7376 5.6866 2.5695 4.0270 5.4651 1.0427 1.8339 4.0423 1.5116 4.1197 1.3356 4.7505 2.4869 3.6137 5.1767 3.7542 4.7847 2.6630 3.0493 2.9697 4.2492 5.2289 1.3744 7.0581 2.3142 6.3393 5.3249 4.0531 1.4184 1.3192 2.7396 1.5834 5.8221 1.3665 1.8773 1.5129 5.8973 1.3118 1.4495 2.6639 1.9937 1.4533 2.3711 2.0154 1.5503 2.7234 1.1211 2.4328 2.4358 1.9510 1.7272 1.6872 1.5056 1.4842 5.0118 1.2346 1.2311 1.2095 3.3250 1.0570 1.0752 1.0596 1.0635 2.5322 1.0478 1.0509 1.0539 2.3079 5.3824 6.4337 7.6589 1.0430 1.0508 1.0403 1.0385 1.0966 1.0988 1.0989 1.1003 1.0993 1.0995 1.0996 1.0892 1.0922 1.0953 1.0954 1.0761
irintensity: 0.0004 0.6718 0.7399 1.2512 4.2201 0.2810 4.2176 0.7058 0.0129 2.1480 1.6604 1.1073 2.1708 0.1785 8.9427 3.5842 6.7190 3.2331 4.0914 4.6222 2.2574 7.4967 1.9987 3.1483 0.4601 39.0764 8.9370 28.5949 7.5431 47.3359 17.2912 5.9199 54.5204 109.4313 48.1069 19.3829 3.5825 14.6628 1.9930 15.4766 3.2891 15.5799 143.2089 34.9477 24.3027 2.7407 32.7595 45.5506 676.8186 8.1572 61.8986 17.5380 8.8534 21.8439 36.9078 6.9369 12.5254 129.1501 34.9304 39.6004 17.4159 77.8342 1.5878 26.0880 16.6097 2.1154 88.1999 4.1971 23.0501 9.3873 448.4169 166.8671 169.7628 163.2092 25.2805 17.4341 25.5913 33.8778 0.1873 26.5867 21.5839 42.7652 60.0165 24.4651 13.1927 12.7907 2.0584 2.4721 6.2888 29.0851
temp: 298.150 k
press: 1.00000 atm
elementType: 17 8 8 7 6 6 6 6 6 6 6 6 6 6 6 6 1 1 1 1 1 1 1 1 1 1 1 1 1 1 1 1
symmnumber: 1
zpe: 676556.4 jmol-1
zpe.correction: 0.257687 hartree
zpe.thermalcorrener: 0.274674 hartree
zpe.thermalcorrenthalpy: 0.275618 hartree
zpe.thermalcorrgfe: 0.212005 hartree
zpe.sumelectzpe: -1130.952740 hartree
zpe.sumelectthermal: -1130.935753 hartree
zpe.sumelectthermalent: -1130.934809 hartree
zpe.sumelectthermalfe: -1130.998422 hartree
dipole: -2.9556 -0.8922 -0.1636
dipole: 3.0916
quadrupole: -98.8886 -99.8808 -104.8504
quadrupole: 8.5762 1.0284 1.1932
quadrupole: 2.3180 1.3258 -3.6438 8.5762 1.0284 1.1932
hfenergy: -1131.2104269 hartree
pointgroup: C01 [X(C12H16Cl1N1O2)]
dipole: 1.1852218 -0.2606929 0.0823142 debye
polarizability: 233.7796936|9.3756842|149.6597869|6.1619826|-4.8325726|95.4470883 unknown
InChI: InChI=1S/C12H16ClNO2/c1-4-12(2,3)16-11(15)14-10-7-5-6-9(13)8-10/h5-8,14H,4H2,1-3H3
charge 0 multiplicity 1
32 atoms
Cl -5.223696 -1.8929 0.021129
O  2.011747 -0.641766 0.360505
O  1.037206 1.502894 0.06565
N  -0.220126 -0.50008 0.199819
C  3.454169 -0.143616 0.398214
C  3.807896 0.563858 -0.937401
C  3.627566 0.802944 1.603265
C  4.231755 -1.454583 0.605802
C  3.57034 -0.270616 -2.213096
C  0.951697 0.255275 0.195083
C  -1.554803 -0.040331 0.066707
C  -2.58217 -1.023821 0.10126
C  -1.893287 1.330629 -0.094685
C  -3.918637 -0.614683 -0.025929
C  -3.250166 1.695132 -0.218626
C  -4.287395 0.733893 -0.187102
H  3.229274 1.502371 -0.993629
H  4.877635 0.847555 -0.87147
H  4.697187 1.057039 1.718903
H  3.057142 1.734674 1.463178
H  3.289924 0.311026 2.532683
H  5.31735 -1.25019 0.599609
H  3.96593 -1.909474 1.57551
H  4.006151 -2.183199 -0.190107
H  3.786738 0.336973 -3.110147
H  2.519959 -0.605661 -2.280923
H  4.215771 -1.166478 -2.253949
H  -0.074758 -1.505024 0.318515
H  -2.340512 -2.084854 0.225277
H  -1.101023 2.080407 -0.120177
H  -3.508638 2.752177 -0.343002
H  -5.337223 1.021828 -0.283866
