program: Gaussian 09
title: 000245947
version: EM64L-G09RevD.01
frameworkgroup: C1[X(C15H12F3NO3)]
method: RPBEPBE
basis: SDD
operation: Freq
keyword: #p
keyword: freq=noraman
keyword: PBEPBE/SDD
title: #p freq=noraman PBEPBE/SDD
converged: YES YES NO NO
title: Mulliken charges:
elementType: F F F O O O N C C C C C C C C C C C C C C C H H H H H H H H H H H H
charge: -0.164075 -0.161585 -0.162129 -0.257358 -0.200907 -0.165973 0.010884 0.365166 0.320326 0.343710 0.234751 -0.561089 0.268869 0.323637 -0.384852 -0.388829 -0.425490 -0.294051 -0.384891 -0.808099 -0.803389 0.260602 0.269786 0.240609 0.266992 0.310237 0.283769 0.271851 0.233778 0.235516 0.229357 0.233352 0.231543 0.227980
chargesum: 0.00000
title: Mulliken charges with hydrogens summed into heavy atoms:
elementType: F F F O O O N C C C C C C C C C C C C C C C
charge: -0.164075 -0.161585 -0.162129 -0.257358 -0.200907 -0.165973 0.010884 0.365166 0.320326 0.343710 0.234751 -0.291303 0.268869 0.323637 -0.144243 -0.121836 -0.115253 -0.010282 -0.113040 -0.109449 -0.110514 0.260602
polarizability: 2.67001201e+02 -1.61819720e+01 1.76192007e+02 -1.63326976e+01 -5.57031796e+00 1.33402292e+02
1716.lowfreq: -21.1022 -16.1288 -10.8465 -3.5626 -0.0007 -0.0006 -0.0005 4.7389 23.7221
frequency: -19.5470 -11.2195 21.7563 35.7729 42.5022 77.6429 81.8797 117.2317 127.6454 131.2998 137.9619 162.5760 208.4889 217.5350 267.5458 279.3378 289.8889 310.3025 329.5212 362.8179 369.1773 388.6493 417.5051 444.6998 455.0128 473.0788 486.6596 507.0218 541.4919 548.2995 570.1935 595.5879 634.0702 652.3486 674.4409 689.3652 712.4724 727.3846 738.4582 740.8678 783.9147 828.2027 834.8965 855.7320 888.5763 923.8090 932.0184 951.8873 970.5504 991.0449 991.8859 999.6370 1011.7929 1030.1600 1051.3918 1052.2828 1066.4660 1112.4509 1146.8343 1162.8725 1188.1950 1202.5532 1236.4181 1249.7976 1256.5015 1275.3605 1297.0548 1364.2294 1370.2349 1382.6545 1393.4946 1400.1213 1407.1505 1424.4779 1458.2657 1468.3266 1470.7580 1475.8251 1485.8259 1493.4707 1572.6194 1592.5153 1611.9695 1625.3350 2971.8241 2974.8313 3044.1078 3049.4015 3087.7998 3090.4777 3137.0711 3143.1606 3165.5715 3174.9412 3175.0316 3183.3446
redmass: 3.5228 16.8563 5.2901 8.4943 7.5428 7.8862 1.0878 3.2426 2.4776 2.3064 3.1485 6.7492 3.5595 9.2383 8.5483 5.2214 2.8928 5.0358 9.2351 5.7427 8.4577 9.5746 4.1126 2.8585 3.6013 6.6536 6.1072 8.7774 5.1173 4.3511 6.5268 7.2179 5.2406 8.2637 7.3888 6.6602 3.5560 5.8206 4.6658 4.3047 6.9651 1.3736 1.4370 7.4950 1.3998 1.5183 3.6567 1.3416 1.5406 5.0410 1.6632 1.4875 7.5817 1.4538 7.2065 1.6603 2.9538 1.7216 1.6167 1.3527 2.7323 8.7944 2.9954 1.7968 4.7098 1.3127 2.6484 6.1417 6.4617 7.7509 1.2322 2.7634 1.3098 5.5576 1.0467 1.1510 1.0591 1.4087 2.1197 2.5667 8.1700 7.1994 6.4875 6.8476 1.0378 1.0382 1.0969 1.0968 1.0985 1.0980 1.0897 1.0922 1.0884 1.0929 1.0959 1.0969
irintensity: 0.0745 0.0062 0.4446 0.4390 0.1283 1.8627 0.0445 1.4393 2.1938 1.0211 0.5084 0.7983 1.2166 0.3828 1.0324 3.9121 1.0567 3.4070 0.6615 3.5958 0.8406 1.9461 1.1160 6.6780 2.8770 1.4257 2.7752 1.5126 1.4380 10.3202 20.6339 15.1240 2.0106 14.9008 1.7801 0.8255 2.1616 20.4677 4.8220 6.1058 15.3180 24.8570 62.6033 13.0368 11.9068 41.5559 32.6091 1.5286 33.7938 167.8521 22.4293 37.0994 212.5802 14.7823 137.6428 1.6689 34.0943 2.5439 49.3907 19.2813 34.9528 309.3653 55.5302 129.2629 260.1716 19.0686 288.9105 68.3437 16.7575 56.3216 7.3311 3.9156 26.5721 4.7654 0.0036 28.9473 32.1131 27.0935 198.1285 7.1837 35.1191 30.9959 44.6588 118.2642 44.0643 16.7326 32.6230 3.0778 33.8509 4.8536 18.7407 2.7602 0.0934 6.1493 2.6549 0.6555
temp: 298.150 k
press: 1.00000 atm
elementType: 9 9 9 8 8 8 7 6 6 6 6 6 6 6 6 6 6 6 6 6 6 6 1 1 1 1 1 1 1 1 1 1 1 1
symmnumber: 1
zpe: 628372.1 jmol-1
zpe.correction: 0.239334 hartree
zpe.thermalcorrener: 0.258121 hartree
zpe.thermalcorrenthalpy: 0.259066 hartree
zpe.thermalcorrgfe: 0.190723 hartree
zpe.sumelectzpe: -1157.079811 hartree
zpe.sumelectthermal: -1157.061023 hartree
zpe.sumelectthermalent: -1157.060079 hartree
zpe.sumelectthermalfe: -1157.128421 hartree
dipole: 6.9794 -4.7407 -0.7225
dipole: 8.4680
quadrupole: -122.4099 -143.3120 -122.5004
quadrupole: -7.8268 1.9077 -4.5135
quadrupole: 6.9975 -13.9046 6.9070 -7.8268 1.9077 -4.5135
hfenergy: -1157.3191448 hartree
pointgroup: C01 [X(C15H12F3N1O3)]
dipole: 2.5893605 -2.0956094 0.0555283 debye
polarizability: 265.2926926|-23.8208207|178.5190006|-5.5060833|-9.2853857|132.7838059 unknown
InChI: InChI=1S/C15H12F3NO3/c1-9-3-5-12(7-10(9)2)22-14-6-4-11(15(16,17)18)8-13(14)19(20)21/h3-8H,1-2H3
charge 0 multiplicity 1
34 atoms
F  -4.330753 -2.501303 -0.500983
F  -5.062509 -0.830475 0.85195
F  -5.129813 -0.572057 -1.392834
O  0.895344 1.235675 -0.195189
O  -2.417667 3.491168 0.65942
O  -0.451245 3.549124 -0.497264
N  -1.442824 2.919853 0.026552
C  3.621028 -0.974373 1.160392
C  4.533367 -0.954906 0.057793
C  2.085519 0.430515 -0.124191
C  -0.348859 0.630649 -0.254201
C  2.395863 -0.272845 1.056756
C  -1.51559 1.446119 -0.124053
C  -2.951754 -0.514709 -0.311788
C  4.189868 -0.226931 -1.10801
C  2.967715 0.474447 -1.21518
C  -2.801629 0.874368 -0.134092
C  -0.523273 -0.767968 -0.426812
C  -1.80745 -1.332971 -0.465194
C  3.960374 -1.724267 2.435109
C  5.858741 -1.690021 0.136229
C  -4.333256 -1.09805 -0.338564
H  1.694968 -0.258913 1.898702
H  4.892925 -0.203251 -1.948224
H  2.708195 1.051444 -2.107065
H  -3.663289 1.534897 -0.000068
H  0.358852 -1.404543 -0.532242
H  -1.923267 -2.41066 -0.610568
H  4.890073 -1.337649 2.894467
H  3.154042 -1.637505 3.18225
H  4.128174 -2.800725 2.23992
H  6.433469 -1.577622 -0.79812
H  6.485652 -1.310236 0.965751
H  5.715709 -2.77258 0.317752
