program: Gaussian 09
title: 000245984
version: EM64L-G09RevD.01
frameworkgroup: C1[X(C22H24N2O4)]
method: RPBEPBE
basis: SDD
operation: Freq
keyword: #p
keyword: freq=noraman
keyword: PBEPBE/SDD
title: #p freq=noraman PBEPBE/SDD
converged: YES YES NO NO
title: Mulliken charges:
elementType: O O O O N N C C C C C C C C C C C C C C C C C C C C C C H H H H H H H H H H H H H H H H H H H H H H H H
charge: -0.343019 -0.337960 -0.269648 -0.257042 -0.461269 -0.462189 0.235680 0.230745 -0.713763 -0.712883 -0.717492 -0.707189 0.012923 0.031655 0.301500 0.279595 0.480310 0.462503 -0.441611 -0.446687 -0.350424 -0.348268 -0.207053 -0.196140 -0.211516 -0.211428 -0.262079 -0.266449 0.282829 0.224201 0.213415 0.215285 0.230731 0.239712 0.230170 0.220186 0.238841 0.220913 0.285541 0.220142 0.325435 0.326535 0.224245 0.221896 0.297580 0.308368 0.225197 0.225387 0.223768 0.234648 0.226727 0.227446
chargesum: 0.00000
title: Mulliken charges with hydrogens summed into heavy atoms:
elementType: O O O O N N C C C C C C C C C C C C C C C C C C C C C C
charge: -0.343019 -0.337960 -0.269648 -0.257042 -0.135834 -0.135654 0.235680 0.230745 0.006682 -0.027155 -0.028296 0.019407 0.012923 0.031655 0.301500 0.279595 0.480310 0.462503 -0.217365 -0.224792 -0.052843 -0.039900 0.018144 0.029247 0.012252 0.023220 -0.035352 -0.039003
polarizability: 3.50126737e+02 2.02039330e+01 2.44176320e+02 -1.16568296e+01 1.40476809e+01 2.14403204e+02
1716.lowfreq: -4.9018 -3.0205 0.0004 0.0006 0.0008 4.7489 10.8502 17.6427 22.3211
frequency: 10.3380 17.2821 22.2806 30.0269 41.0154 51.6074 63.2356 77.8562 85.3760 88.1313 96.1011 106.5833 128.5817 148.3851 166.8878 204.2270 204.9650 210.0171 217.5215 232.8572 243.0494 245.5690 250.5920 254.6523 262.5290 267.4386 322.4051 335.2447 345.1239 350.0249 360.2520 370.3950 406.9420 408.5735 434.0266 498.1296 503.0026 508.9738 510.7812 541.8803 547.5836 572.1814 596.6891 612.0820 613.4581 632.5279 636.1629 637.1867 686.9894 694.7628 695.8146 698.1619 715.4806 722.9950 742.3327 765.9884 766.4070 767.2997 838.4997 843.2336 845.1786 861.0276 864.6385 910.7125 915.6013 923.3963 928.9836 935.8208 957.3607 968.5399 969.4242 971.6678 984.5978 984.9999 995.6232 1000.8142 1004.9492 1009.1506 1010.3753 1027.1801 1027.5977 1087.5587 1089.4363 1110.6237 1121.5400 1162.4652 1166.4881 1171.0028 1171.6759 1188.0967 1189.7172 1197.5890 1198.9917 1224.4703 1256.3171 1262.9518 1288.5588 1323.6527 1324.2412 1373.3889 1373.7989 1384.3972 1386.1748 1391.5594 1391.8284 1429.8496 1432.2422 1449.0980 1450.3073 1464.4158 1465.2160 1466.7785 1468.6434 1484.7616 1485.8742 1487.5573 1489.4339 1507.2834 1515.3853 1598.8580 1599.7315 1615.3040 1617.9963 1661.8022 1672.1190 2275.2634 2996.3508 2997.2917 3001.2532 3002.4167 3090.7013 3093.4630 3105.0137 3107.0159 3111.2596 3112.8903 3113.1993 3113.5558 3127.8994 3130.1101 3131.9230 3132.0453 3140.8116 3143.8364 3162.9821 3164.3833 3190.7760 3190.9297 3542.7196 3546.2367
redmass: 4.8668 5.4627 6.1311 4.1488 4.1610 5.7020 4.4265 5.0575 4.9044 4.8669 5.1700 5.7586 4.7896 3.4527 3.6933 1.0909 1.1317 2.6094 3.5474 3.9650 3.6325 3.8475 1.4720 1.2430 2.6668 3.6856 4.2957 5.5575 5.9978 4.7439 3.3938 2.9213 2.9356 2.9443 3.2367 4.9093 5.5905 2.8305 2.9249 6.0756 6.7023 4.6857 4.8845 6.2720 6.4009 3.1595 1.3273 1.3777 4.8812 2.1070 3.3011 2.8955 7.9448 6.8245 6.5638 1.8823 1.6822 3.4020 1.2733 3.8517 1.2784 5.6790 5.0418 1.4348 1.4194 1.9845 1.6316 1.7137 6.2967 5.7894 1.4107 1.3538 6.0752 6.1010 1.3071 1.3012 1.7749 1.3376 1.3091 2.1331 2.1154 1.5881 1.5759 2.1426 2.1427 2.8305 2.9860 1.0537 1.0511 1.1124 1.1110 3.8032 3.6570 2.6581 2.1234 2.0697 4.0030 1.4145 1.4091 1.1986 1.1978 6.9096 7.0166 1.2033 1.2058 2.3379 2.3503 1.0507 1.0501 1.0518 1.0488 1.0568 1.0566 2.1922 2.1818 1.0641 1.0532 2.2161 2.2520 5.3736 5.3130 6.0375 6.0515 8.7885 8.8532 11.9702 1.0360 1.0356 1.0349 1.0349 1.0998 1.1001 1.1002 1.1002 1.0876 1.1009 1.1010 1.0880 1.1005 1.0871 1.0870 1.1000 1.0937 1.0935 1.0995 1.0997 1.0951 1.0949 1.0761 1.0761
irintensity: 0.2942 0.6178 0.1081 0.8909 0.6015 0.9831 1.1655 0.3547 2.0467 4.6146 0.2006 3.0102 0.7663 1.7233 0.1800 0.2989 0.7656 5.2197 1.8548 4.7115 1.7134 1.5759 0.9730 0.5307 3.5383 1.9340 9.3338 2.2935 2.4285 0.1613 1.9046 6.5113 0.0267 0.0261 5.7274 5.9545 17.2810 44.3355 9.4731 3.7188 11.8215 4.6476 1.7230 0.9524 0.5790 5.8969 13.3456 43.9238 23.1453 59.3743 7.2853 53.9596 20.9026 32.4053 14.3299 82.0515 122.5098 68.2517 0.6625 7.6989 2.2675 1.0645 3.6467 19.3515 5.1773 0.3484 11.5298 16.8658 113.6511 410.0018 20.7274 1.9386 9.0803 10.0248 3.1823 1.5271 6.6933 9.3248 9.0580 1.2032 1.6695 44.5495 46.3715 95.1407 614.9991 26.4831 175.9507 1.5186 1.4118 5.6717 5.3491 2.7563 20.3000 2.1795 3.7411 6.5859 200.8394 13.8942 73.6167 16.3385 45.8329 36.3347 66.4785 21.2380 35.0078 76.2586 137.1754 9.1864 10.8998 0.4008 0.7749 0.5074 2.6115 9.8571 14.2480 12.1564 14.4730 167.3156 715.3294 26.4367 24.2638 33.5831 149.4568 208.7818 246.3197 0.4061 18.3308 16.1297 26.8468 25.3962 15.1871 13.6746 37.2432 32.0181 12.0758 15.3892 27.5137 11.5666 6.0824 0.5974 1.0898 5.0734 33.6352 31.3073 23.9754 25.2672 6.5468 3.4349 31.0298 26.2160
temp: 298.150 k
press: 1.00000 atm
elementType: 8 8 8 8 7 7 6 6 6 6 6 6 6 6 6 6 6 6 6 6 6 6 6 6 6 6 6 6 1 1 1 1 1 1 1 1 1 1 1 1 1 1 1 1 1 1 1 1 1 1 1 1
symmnumber: 1
zpe: 1085191.5 jmol-1
zpe.correction: 0.413328 hartree
zpe.thermalcorrener: 0.441505 hartree
zpe.thermalcorrenthalpy: 0.442449 hartree
zpe.thermalcorrgfe: 0.351675 hartree
zpe.sumelectzpe: -1261.086745 hartree
zpe.sumelectthermal: -1261.058567 hartree
zpe.sumelectthermalent: -1261.057623 hartree
zpe.sumelectthermalfe: -1261.148397 hartree
dipole: -0.4775 -3.0746 -1.8662
dipole: 3.6282
quadrupole: -144.0321 -154.8181 -157.2174
quadrupole: 5.7852 -1.6911 -2.3906
quadrupole: 7.9905 -2.7956 -5.1948 5.7852 -1.6911 -2.3906
hfenergy: -1261.5000725 hartree
pointgroup: C01 [X(C22H24N2O4)]
dipole: -0.4706605 -0.8812507 -1.0195662 debye
polarizability: 353.2848891|-1.9611331|229.6457585|-11.4606572|20.8563729|225.7756132 unknown
InChI: InChI=1S/C22H24N2O4/c1-21(2,27-19(25)23-17-11-7-5-8-12-17)15-16-22(3,4)28-20(26)24-18-13-9-6-10-14-18/h5-14,23-24H,1-4H3
charge 0 multiplicity 1
52 atoms
O  -1.809263 2.429276 -0.826407
O  -1.93058 -2.616397 0.047017
O  -1.423199 2.32096 1.519357
O  -0.316018 -0.943757 0.528917
N  0.314278 2.390072 -0.090213
N  0.143085 -2.843688 -0.805297
C  -3.269002 2.006337 -0.732545
C  -3.037607 -1.87523 0.789431
C  -4.060583 2.999643 0.147161
C  -3.721184 2.063494 -2.206337
C  -4.269761 -2.758362 0.508319
C  -2.692555 -1.818726 2.295033
C  -3.307348 0.626446 -0.208665
C  -3.198117 -0.524107 0.218055
C  -1.001964 2.362346 0.340484
C  -0.651135 -2.018879 -0.021098
C  1.493467 2.381062 0.699426
C  1.515432 -2.666518 -1.137244
C  2.738229 2.402211 0.012891
C  2.112462 -3.64293 -1.980167
C  1.473402 2.349872 2.119259
C  2.291374 -1.573932 -0.665507
C  3.948423 2.394572 0.735646
C  3.468559 -3.530198 -2.347226
C  2.694522 2.344474 2.826658
C  3.648269 -1.477495 -1.042805
C  3.935909 2.367218 2.149955
C  4.247715 -2.445374 -1.880866
H  -3.706327 2.965967 1.18749
H  -3.929475 4.021545 -0.24989
H  -5.134875 2.743976 0.117923
H  -4.782907 1.772877 -2.283773
H  -3.600932 3.090974 -2.589919
H  -3.118573 1.378037 -2.823977
H  -4.096899 -3.77387 0.903516
H  -5.158005 -2.3282 1.001246
H  -4.461117 -2.823192 -0.575179
H  -3.548681 -1.399237 2.851947
H  -1.814244 -1.179534 2.468521
H  -2.492736 -2.839425 2.666095
H  0.429397 2.356338 -1.105144
H  -0.328955 -3.670046 -1.178566
H  2.756174 2.42376 -1.084477
H  1.515431 -4.488253 -2.34617
H  0.515893 2.319857 2.642757
H  1.837544 -0.823502 -0.015302
H  4.90032 2.416724 0.192796
H  3.915353 -4.291115 -2.996811
H  2.6718 2.318447 3.922077
H  4.236505 -0.632426 -0.667139
H  4.875527 2.362712 2.712429
H  5.301976 -2.359405 -2.164382
