program: Gaussian 09
title: 000245946
version: EM64L-G09RevD.01
frameworkgroup: C1[X(C14H10F3NO3)]
method: RPBEPBE
basis: SDD
operation: Freq
keyword: #p
keyword: freq=noraman
keyword: PBEPBE/SDD
title: #p freq=noraman PBEPBE/SDD
converged: YES YES NO NO
title: Mulliken charges:
elementType: F F F O O O N C C C C C C C C C C C C C C H H H H H H H H H H
charge: -0.165117 -0.163841 -0.158018 -0.257817 -0.200271 -0.165782 0.009764 0.231169 0.330203 0.268531 -0.483178 -0.299265 0.354057 -0.324860 0.473478 -0.512985 0.261790 -0.390348 -0.411744 -0.179941 -0.801664 0.314240 0.285331 0.267857 0.269000 0.269765 0.239836 0.236332 0.230736 0.233480 0.239261
chargesum: 0.00000
title: Mulliken charges with hydrogens summed into heavy atoms:
elementType: F F F O O O N C C C C C C C C C C C C C C
charge: -0.165117 -0.163841 -0.158018 -0.257817 -0.200271 -0.165782 0.009764 0.231169 0.330203 0.268531 -0.168937 -0.013935 0.354057 -0.057003 0.473478 -0.243984 0.261790 -0.120584 -0.171908 0.056391 -0.098187
polarizability: 2.43174921e+02 -1.26064851e+01 1.72003010e+02 -2.03382964e+01 -5.20361332e+00 1.22849616e+02
1716.lowfreq: -15.0182 -4.2126 -0.0011 -0.0009 -0.0006 5.8314 7.1722 17.5941 28.5762
frequency: -14.0756 17.5546 28.5394 30.7357 38.6926 49.0461 81.5185 126.7051 134.8155 163.4598 206.9893 217.4677 219.0769 258.6280 280.6973 334.0507 338.3478 364.2389 387.2256 416.0250 427.7135 439.7190 472.3615 501.9418 512.2114 523.5596 542.8525 578.0310 594.5372 640.3742 656.4127 677.2303 692.5913 694.3737 725.5533 743.8649 779.0732 798.8354 833.7684 851.1391 884.1488 912.7382 921.1318 932.9100 970.3548 983.7408 985.8631 988.2359 1000.1801 1032.3173 1037.2423 1048.9253 1067.4022 1087.7829 1129.5702 1167.9306 1175.0852 1202.2885 1231.8431 1249.3081 1254.1832 1294.8163 1298.3858 1365.7474 1377.3503 1385.6579 1400.4339 1421.6045 1426.0988 1472.2339 1474.4207 1478.9639 1492.0068 1573.7977 1593.7135 1614.4225 1627.1906 2980.6959 3063.0725 3092.7815 3133.8907 3140.6531 3156.0256 3158.9408 3179.3510 3180.0587 3185.7705
redmass: 16.1706 4.3955 1.1428 3.4539 11.9923 7.6713 7.4691 12.3592 5.3538 7.9793 3.5843 5.1567 8.7714 10.1699 4.5666 9.8976 6.9965 7.2677 9.3719 3.9034 4.6528 2.9211 7.1233 9.7388 5.3310 5.2792 5.4892 7.1177 8.2389 5.6449 7.8731 7.3896 4.9624 2.7793 7.6077 4.7470 5.5275 1.5663 1.4450 7.5279 1.3243 1.4302 3.2923 1.5471 1.3534 1.3729 7.7107 5.6357 1.5343 6.7649 8.1485 1.5653 2.9957 1.5182 1.8557 1.3478 1.1165 8.9546 2.8770 2.2677 3.0823 1.8548 1.6569 7.1232 7.8450 6.9992 1.2219 2.7168 4.7006 1.3788 1.0673 1.8654 3.0039 8.1764 6.2425 6.7557 6.7725 1.0390 1.0951 1.0999 1.0881 1.0923 1.0935 1.0895 1.0978 1.0960 1.0928
irintensity: 0.2936 0.4132 0.6598 0.7127 0.5256 0.0036 1.6932 3.7065 0.6359 0.6801 2.0149 0.5922 0.4102 1.5450 1.8632 2.0246 2.0889 1.4387 1.9410 1.5068 1.6690 9.1290 1.5534 4.1098 1.2295 6.1549 3.0382 15.0711 18.4051 4.7801 13.0320 8.0028 1.8421 10.3070 29.5852 11.5362 18.4067 48.0110 46.4290 20.7202 4.2825 3.0926 40.6778 68.3546 1.6114 1.3071 183.8717 10.8838 6.8672 133.3841 208.2346 14.6679 28.4027 18.0043 51.3016 14.2889 0.5139 307.0363 1.4623 30.9291 494.9569 167.4664 105.9099 104.4387 6.5639 18.2608 15.4369 23.9365 5.0093 10.0865 13.4868 119.8936 70.2334 60.8299 64.8187 32.6501 118.3714 23.5743 18.4520 15.8782 7.2994 5.9383 19.3011 0.5680 2.9795 0.0675 10.0503
temp: 298.150 k
press: 1.00000 atm
elementType: 9 9 9 8 8 8 7 6 6 6 6 6 6 6 6 6 6 6 6 6 6 1 1 1 1 1 1 1 1 1 1
symmnumber: 1
zpe: 557526.9 jmol-1
zpe.correction: 0.212351 hartree
zpe.thermalcorrener: 0.230403 hartree
zpe.thermalcorrenthalpy: 0.231348 hartree
zpe.thermalcorrgfe: 0.162813 hartree
zpe.sumelectzpe: -1117.850977 hartree
zpe.sumelectthermal: -1117.832924 hartree
zpe.sumelectthermalent: -1117.831980 hartree
zpe.sumelectthermalfe: -1117.900514 hartree
dipole: 5.7165 -4.7465 -1.0619
dipole: 7.5057
quadrupole: -117.0124 -134.8672 -116.9471
quadrupole: -10.4254 0.7403 -5.7222
quadrupole: 5.9299 -11.9250 5.9951 -10.4254 0.7403 -5.7222
hfenergy: -1118.0633274 hartree
pointgroup: C01 [X(C14H10F3N1O3)]
dipole: 2.0927648 -2.0761309 0.1734086 debye
polarizability: 242.4379203|-21.0388372|170.2970413|-8.8551969|-15.6978797|125.2925859 unknown
InChI: InChI=1S/C14H10F3NO3/c1-9-3-2-4-11(7-9)21-13-6-5-10(14(15,16)17)8-12(13)18(19)20/h2-8H,1H3
charge 0 multiplicity 1
31 atoms
F  -4.377684 -1.898383 -1.179523
F  -4.353084 -1.569841 1.057216
F  -5.061058 0.091339 -0.316588
O  1.290908 1.013312 -0.444073
O  -1.796773 3.59686 0.331856
O  0.128941 3.399723 -0.877417
N  -0.893206 2.898452 -0.279382
C  0.000263 0.512547 -0.397802
C  -2.686311 -0.410057 -0.280511
C  -1.089778 1.429478 -0.305966
C  -2.41885 0.967733 -0.22694
C  -0.292055 -0.878252 -0.447405
C  2.419527 0.150691 -0.227505
C  -1.616451 -1.33417 -0.398554
C  3.77111 -1.258083 1.24159
C  2.592271 -0.505264 1.00809
C  -4.091886 -0.923481 -0.186052
C  3.389068 0.10874 -1.245682
C  4.752582 -1.314532 0.216815
C  4.565492 -0.637458 -1.009551
C  3.969496 -1.989553 2.557437
H  -3.221699 1.702811 -0.127473
H  0.531305 -1.592143 -0.531302
H  -1.823149 -2.407231 -0.459129
H  1.828356 -0.41589 1.788864
H  3.225032 0.658571 -2.17639
H  5.673229 -1.884136 0.387335
H  5.339676 -0.682658 -1.78263
H  5.040014 -2.152164 2.769704
H  3.534829 -1.428875 3.403388
H  3.482383 -2.983586 2.537179
