program: Gaussian 09
title: 000245949
version: EM64L-G09RevD.01
frameworkgroup: C1[X(C15H12F3NO4)]
method: RPBEPBE
basis: SDD
operation: Freq
keyword: #p
keyword: freq=noraman
keyword: PBEPBE/SDD
title: #p freq=noraman PBEPBE/SDD
converged: YES YES NO NO
title: Mulliken charges:
elementType: F F F O O O O N C C C C C C C C C C C C C C C H H H H H H H H H H H H
charge: -0.164637 -0.163504 -0.158236 -0.269717 -0.263414 -0.195226 -0.165405 0.009903 0.243735 0.323672 0.262128 -0.472553 -0.307946 -0.324676 0.383414 -0.526461 0.378346 0.263521 -0.397605 -0.384567 -0.167520 -0.243463 -0.683042 0.311312 0.289655 0.268986 0.279549 0.270565 0.258772 0.236429 0.210955 0.216977 0.212171 0.234882 0.232999
chargesum: 0.00000
title: Mulliken charges with hydrogens summed into heavy atoms:
elementType: F F F O O O O N C C C C C C C C C C C C C C C
charge: -0.164637 -0.163504 -0.158236 -0.269717 -0.263414 -0.195226 -0.165405 0.009903 0.243735 0.323672 0.262128 -0.161241 -0.018291 -0.055689 0.383414 -0.246912 0.378346 0.263521 -0.127040 -0.125796 0.068909 0.184468 -0.002989
polarizability: 2.85037382e+02 -9.52183277e+00 1.78368963e+02 2.29409963e+00 -1.39529445e+01 1.39420373e+02
1716.lowfreq: -5.6068 -1.3286 -0.0005 0.0002 0.0006 2.9655 10.9469 21.6510 26.4771
frequency: 10.8661 21.1049 26.4357 38.0367 49.6815 70.1993 84.3032 112.2425 114.6258 131.5444 144.0191 165.8090 206.4591 223.1463 229.2986 249.5108 257.6567 300.4645 323.1462 338.8353 360.2272 377.1978 389.0167 422.0286 449.4390 451.6917 469.9197 501.5430 527.3163 567.8731 574.9702 583.9259 601.4876 644.0630 654.8873 679.1786 682.2393 697.4511 722.0833 747.7343 771.7536 783.4247 824.3693 837.7644 841.8448 858.3582 877.9508 885.8740 929.7397 961.7659 968.2409 974.3321 981.5994 985.4915 1029.9086 1032.4867 1039.3672 1067.0657 1078.7100 1115.5247 1124.9335 1135.5311 1166.3591 1171.2576 1206.0926 1231.5782 1250.4015 1257.9602 1265.7307 1288.9300 1296.3107 1367.3546 1368.0776 1382.4414 1391.5830 1401.8758 1424.2638 1440.6363 1462.0125 1468.1327 1479.9235 1490.8890 1492.6268 1575.5887 1582.7707 1617.1931 1627.1782 2959.9727 2999.0877 3020.2499 3096.4847 3108.4690 3147.1566 3161.4001 3168.5556 3180.4081 3181.0684 3183.4663 3185.6750
redmass: 6.2852 13.8153 6.6147 10.6243 7.9767 3.9085 5.1001 1.8595 7.3645 6.0506 5.6803 6.6972 6.3937 8.7953 2.3491 1.7680 6.0788 5.1829 8.0964 7.3920 6.9088 7.1379 8.8702 4.4733 3.1437 4.3277 6.6418 9.9296 8.1009 5.2226 6.1782 8.4837 6.7968 6.8225 7.7179 4.4731 2.6280 8.3312 7.1463 5.1376 4.7477 1.4621 1.1627 1.5834 4.1830 1.5419 4.0558 1.4293 1.5151 3.6433 1.3341 1.3479 5.9430 8.1441 6.1622 2.6474 8.2570 3.0116 1.5816 1.9415 2.0735 1.4395 1.2827 1.1747 8.4828 3.5436 1.8740 4.8215 1.1395 1.3836 2.5193 2.0918 2.5327 7.3076 4.6284 1.3386 5.5275 3.3720 1.0396 1.8338 1.1712 1.2543 2.6129 8.2936 6.6978 7.0384 6.8806 1.0555 1.0363 1.1077 1.0989 1.1015 1.0874 1.0893 1.0932 1.0969 1.0961 1.0940 1.0925
irintensity: 0.2041 0.0229 1.3823 0.8795 0.6103 1.8439 0.5573 3.0372 6.7575 0.7890 0.5409 0.5230 0.0619 1.7128 0.4961 1.1343 0.9986 1.4325 6.3792 3.6481 0.2680 0.8161 2.0879 7.8825 8.4325 0.4495 1.2571 1.4947 3.1825 7.9697 14.8638 4.0570 20.9113 3.5343 11.9152 13.6988 9.7119 3.4067 18.4556 12.4817 13.2882 36.7474 24.6031 41.5469 36.6784 25.9221 12.5552 2.2688 66.8085 131.2079 2.7828 0.7121 55.2059 178.4368 140.3850 79.3815 190.2942 35.1132 17.1466 30.9290 136.3657 4.6640 15.2973 9.0246 277.7172 221.3984 147.2355 320.1046 0.0653 4.5297 308.7555 26.3607 103.1866 44.7936 13.1028 41.2826 7.0145 25.2357 12.5889 175.2995 29.1326 11.7186 98.0167 73.4249 116.7288 249.5326 46.7958 31.4071 23.0255 30.2870 24.3091 31.7224 9.5397 0.9152 5.1526 4.3033 0.9713 8.3693 0.5098
temp: 298.150 k
press: 1.00000 atm
elementType: 9 9 9 8 8 8 8 7 6 6 6 6 6 6 6 6 6 6 6 6 6 6 6 1 1 1 1 1 1 1 1 1 1 1 1
symmnumber: 1
zpe: 642435.7 jmol-1
zpe.correction: 0.244691 hartree
zpe.thermalcorrener: 0.265834 hartree
zpe.thermalcorrenthalpy: 0.266779 hartree
zpe.thermalcorrgfe: 0.190660 hartree
zpe.sumelectzpe: -1232.203201 hartree
zpe.sumelectthermal: -1232.182057 hartree
zpe.sumelectthermalent: -1232.181113 hartree
zpe.sumelectthermalfe: -1232.257231 hartree
dipole: 5.2141 -3.6624 -1.1210
dipole: 6.4697
quadrupole: -136.9036 -144.7078 -126.7780
quadrupole: 1.8311 -11.0245 -7.7027
quadrupole: -0.7738 -8.5780 9.3519 1.8311 -11.0245 -7.7027
hfenergy: -1232.4478915 hartree
pointgroup: C01 [X(C15H12F3N1O4)]
dipole: 1.7843194 -1.6113443 0.8358655 debye
polarizability: 267.553412|-48.6569405|152.905781|-7.8308143|0.5014659|182.3675253 unknown
InChI: InChI=1S/C15H12F3NO4/c1-2-22-11-4-3-5-12(9-11)23-14-7-6-10(15(16,17)18)8-13(14)19(20)21/h3-9H,2H2,1H3
charge 0 multiplicity 1
35 atoms
F  -5.226986 -0.483729 2.200716
F  -4.885762 1.706272 2.652586
F  -5.802753 1.09787 0.670629
O  0.414103 0.38223 -0.687938
O  4.498408 -2.283973 -0.411161
O  -2.596084 1.991717 -2.848046
O  -0.458609 2.475187 -2.209818
N  -1.605747 1.926728 -2.017802
C  -0.813199 0.50961 -0.057976
C  -3.442609 0.64202 1.006934
C  -1.849183 1.209671 -0.741713
C  -3.157429 1.260552 -0.223009
C  -1.124004 -0.121008 1.176354
C  -2.420393 -0.048648 1.706733
C  1.592409 0.020703 0.042052
C  2.381971 -0.986397 -0.545862
C  3.616298 -1.314796 0.069768
C  -4.813094 0.737594 1.608332
C  1.978916 0.717023 1.202793
C  4.026654 -0.644224 1.252423
C  3.211057 0.361055 1.803611
C  4.141876 -2.992595 -1.66153
C  5.286121 -3.953936 -1.966309
H  -3.930172 1.781515 -0.794608
H  -0.346009 -0.680739 1.701395
H  -2.64776 -0.548384 2.653325
H  2.028493 -1.469005 -1.459584
H  1.362182 1.52403 1.608188
H  4.983522 -0.91859 1.705034
H  3.540646 0.888526 2.704627
H  3.185892 -3.535397 -1.512856
H  4.008601 -2.250709 -2.475034
H  5.0711 -4.51421 -2.894174
H  6.232327 -3.403424 -2.101869
H  5.419015 -4.677241 -1.14401
