program: Gaussian 09
title: 000245938
version: EM64L-G09RevD.01
frameworkgroup: C1[X(C16H16N2O2)]
method: RPBEPBE
basis: SDD
operation: Freq
keyword: #p
keyword: freq=noraman
keyword: PBEPBE/SDD
title: #p freq=noraman PBEPBE/SDD
converged: YES YES NO NO
title: Mulliken charges:
elementType: O O N N C C C C C C C C C C C C C C C C H H H H H H H H H H H H H H H H
charge: -0.369093 -0.315247 -0.316878 0.004372 -0.703565 -0.649828 0.356115 -0.048205 0.447875 0.445497 -0.370469 -0.504727 -0.462829 -0.369492 -0.219491 -0.219485 -0.223989 -0.223179 -0.239614 -0.244954 0.302467 0.249856 0.225733 0.262732 0.274456 0.268223 0.249825 0.253948 0.366605 0.231206 0.232422 0.230005 0.229210 0.233630 0.231980 0.384888
chargesum: 0.00000
title: Mulliken charges with hydrogens summed into heavy atoms:
elementType: O O N N C C C C C C C C C C C C C C C C
charge: 0.015795 -0.315247 0.049727 0.004372 -0.151241 -0.161362 0.356115 -0.048205 0.447875 0.445497 -0.096012 -0.236504 -0.213004 -0.115544 0.011715 0.012937 0.006016 0.006030 -0.005984 -0.012974
polarizability: 1.99547861e+02 6.62527663e+00 1.92884968e+02 8.53754507e+00 -8.03641569e+00 1.87028526e+02
1716.lowfreq: -13.8504 -8.4418 -0.0006 -0.0005 -0.0004 4.0383 22.0670 24.6631 40.2625
frequency: 22.0424 24.6298 40.2374 47.9775 65.8493 74.0829 94.4954 144.3782 175.2566 205.8603 211.9879 222.5783 247.2322 280.6001 306.3787 336.5356 358.7450 388.5663 403.8184 407.8437 414.3100 460.5061 489.2511 517.6696 521.8654 566.7847 591.1744 615.6929 616.1000 670.0789 686.8476 710.9372 711.7992 743.8322 757.5797 799.9021 806.3898 825.0192 860.4233 866.4128 895.6973 907.4467 928.4636 939.2043 964.9026 981.6643 985.5219 987.9297 989.1432 1000.1385 1003.7248 1025.0098 1026.3116 1069.4649 1078.4440 1088.9552 1142.6438 1172.6915 1173.2625 1186.7460 1187.9601 1188.8149 1200.2661 1206.2929 1233.9335 1259.2757 1293.7572 1318.2781 1331.2447 1335.8033 1344.9777 1379.6829 1381.7358 1392.3042 1410.7971 1428.8505 1439.8727 1441.0670 1453.0348 1479.1528 1481.0338 1515.3655 1587.8285 1589.6201 1608.3386 1610.2151 2967.3874 2997.9649 3029.0216 3084.1851 3105.5491 3107.0659 3124.1775 3128.3801 3135.3382 3139.0228 3146.4119 3149.6386 3164.2275 3165.5727 3313.3580 3472.8333
redmass: 5.9037 4.0996 3.9830 6.3972 5.0462 6.4268 5.7718 6.4652 5.4137 6.3541 6.0098 6.6005 6.3831 3.8822 7.1681 2.7506 1.4490 1.9535 2.8298 3.4907 2.2139 3.0811 3.6620 2.5521 4.0618 1.7155 3.3888 6.1828 6.1796 5.3409 4.9607 1.9978 1.9452 1.6298 2.1751 3.5625 3.9644 3.7394 1.2461 1.2465 2.4943 1.6507 1.7908 1.6934 2.6983 1.3971 1.3706 5.4072 5.8215 1.3217 1.3567 2.2452 2.2526 2.2474 1.6545 2.1133 1.7015 1.0595 1.0619 1.1607 1.3602 1.3855 2.8674 2.1142 1.8727 3.8721 1.5890 1.3882 1.2805 1.3060 1.4207 5.9569 6.4434 2.0824 2.1212 1.1458 2.0229 2.1576 1.1565 2.2214 2.1511 2.9986 5.8822 5.9844 5.9826 5.9878 1.0610 1.0620 1.0985 1.0984 1.0885 1.0881 1.0861 1.0862 1.0906 1.0912 1.0958 1.0961 1.1014 1.1014 1.0688 1.0819
irintensity: 0.4195 0.6925 0.6993 1.9260 2.8380 0.9131 0.7177 4.9099 0.6198 10.1845 1.6567 1.3256 2.5830 3.4709 1.2863 3.0243 62.3352 34.2028 0.7485 1.7831 41.3166 6.5552 26.3191 22.2899 7.5523 60.3894 36.2199 0.7106 1.7490 7.2926 8.9801 62.6372 21.1700 66.8387 48.6581 1.9546 6.1941 4.5959 0.1717 0.5733 13.7981 18.6396 5.6027 23.7642 31.7685 0.1599 1.2547 0.3169 0.8798 1.5971 0.1081 5.8494 9.2378 16.8804 18.5683 2.4180 42.7105 1.0990 0.2401 13.9968 35.0744 51.3276 4.7651 12.3680 23.2967 223.8516 5.4460 5.2564 3.9229 2.7709 3.2427 5.2862 0.8493 34.3888 5.2230 17.6345 2.8781 8.9557 23.2631 26.7407 18.0702 154.8249 1.0090 2.1930 12.3770 9.4245 31.7019 13.2275 7.0179 17.4606 6.5238 9.4339 1.4509 0.3123 7.0854 10.2187 29.7359 18.2300 21.9383 26.6465 146.5472 185.3443
temp: 298.150 k
press: 1.00000 atm
elementType: 8 8 7 7 6 6 6 6 6 6 6 6 6 6 6 6 6 6 6 6 1 1 1 1 1 1 1 1 1 1 1 1 1 1 1 1
symmnumber: 1
zpe: 742693.6 jmol-1
zpe.correction: 0.282877 hartree
zpe.thermalcorrener: 0.301174 hartree
zpe.thermalcorrenthalpy: 0.302119 hartree
zpe.thermalcorrgfe: 0.234251 hartree
zpe.sumelectzpe: -877.695354 hartree
zpe.sumelectthermal: -877.677057 hartree
zpe.sumelectthermalent: -877.676113 hartree
zpe.sumelectthermalfe: -877.743980 hartree
dipole: 0.0906 -5.2126 2.3463
dipole: 5.7170
quadrupole: -107.5109 -126.4913 -114.3552
quadrupole: 3.4512 0.5924 11.7330
quadrupole: 8.6083 -10.3722 1.7640 3.4512 0.5924 11.7330
hfenergy: -877.9782315 hartree
pointgroup: C01 [X(C16H16N2O2)]
dipole: -0.084892 -1.6793436 1.4939076 debye
polarizability: 196.6495034|10.4404244|188.7595088|7.241466|-6.557113|194.0523433 unknown
InChI: InChI=1S/C16H16N2O2/c19-17-15(11-13-7-3-1-4-8-13)16(18-20)12-14-9-5-2-6-10-14/h1-10,17,19H,11-12H2
charge 0 multiplicity 1
36 atoms
O  -1.036269 0.074321 2.530248
O  -0.629888 2.378732 -2.209181
N  -0.063688 0.517554 1.56525
N  0.516695 2.444655 -1.572296
C  -1.88374 1.439273 0.211464
C  2.091427 1.82146 0.184964
C  -0.393362 1.253118 0.462138
C  0.652385 1.808191 -0.320143
C  -2.583718 0.131067 -0.165337
C  2.744116 0.443589 0.331944
C  -2.270976 -0.515718 -1.391027
C  -3.552842 -0.453203 0.693724
C  3.417271 0.083319 1.528653
C  2.699225 -0.495421 -0.732059
C  -2.909518 -1.724752 -1.740587
C  -4.192968 -1.665768 0.33951
C  4.03416 -1.183739 1.661212
C  3.314896 -1.758825 -0.602872
C  -3.866606 -2.308338 -0.875158
C  3.983431 -2.109458 0.595191
H  -1.99526 2.166243 -0.607181
H  -2.328287 1.84573 1.140241
H  2.159396 2.360146 1.152227
H  2.65338 2.421168 -0.557281
H  -1.551315 -0.043494 -2.069437
H  -3.847013 0.067797 1.615026
H  3.47869 0.806752 2.352866
H  2.181535 -0.225925 -1.660312
H  0.89359 0.255841 1.825776
H  -2.668348 -2.209937 -2.693158
H  -4.946243 -2.099159 1.006952
H  4.553039 -1.443255 2.590855
H  3.276633 -2.470791 -1.435147
H  -4.359565 -3.246732 -1.151843
H  4.459963 -3.091022 0.693804
H  -1.658626 -0.535416 2.026874
