program: Gaussian 09
title: 000245928
version: EM64L-G09RevD.01
frameworkgroup: C1[X(C11H9ClN4O3)]
method: RPBEPBE
basis: SDD
operation: Freq
keyword: #p
keyword: freq=noraman
keyword: PBEPBE/SDD
title: #p freq=noraman PBEPBE/SDD
converged: YES YES NO NO
title: Mulliken charges:
elementType: Cl O O O N N N N C C C C C C C C C C C H H H H H H H H H
charge: -0.028320 -0.196466 -0.183350 -0.226337 -0.172569 -0.360861 -0.090392 -0.049658 -0.354227 0.220834 0.156283 0.236685 -0.592440 0.156301 -0.263074 -0.311385 -0.176631 -0.181035 -0.114330 0.309596 0.367308 0.254241 0.267576 0.259812 0.279080 0.266660 0.261616 0.265084
chargesum: 0.00000
title: Mulliken charges with hydrogens summed into heavy atoms:
elementType: Cl O O O N N N N C C C C C C C C C C C
charge: -0.028320 -0.196466 -0.183350 -0.226337 -0.172569 0.006447 -0.090392 -0.049658 -0.044631 0.220834 0.156283 0.236685 0.189188 0.156301 0.016006 -0.044725 0.084985 0.084049 -0.114330
polarizability: 2.99766073e+02 2.43381130e+00 1.39118066e+02 8.31049921e+00 1.76487558e+01 1.33283482e+02
1716.lowfreq: -3.3262 -2.4104 -0.0015 0.0006 0.0007 12.0585 20.8196 23.2768 32.7603
frequency: 20.5757 23.1997 32.6233 66.2146 73.6502 78.3564 94.7100 139.1097 174.8570 181.2442 235.5939 252.2960 285.9851 309.8456 326.0806 358.4332 372.5952 373.4571 410.1960 416.1543 438.3708 486.3947 511.4759 518.4892 600.5698 618.5986 624.5802 660.5329 682.0311 704.2006 719.6636 729.6072 767.7883 772.2616 828.2929 831.4263 848.7275 910.4195 946.2648 971.1500 972.6699 981.9057 995.2792 1067.3343 1101.6581 1104.3231 1129.7113 1150.4336 1160.5656 1193.5027 1240.0320 1266.4731 1286.2090 1288.7601 1317.0594 1350.3290 1369.0877 1379.0491 1387.2453 1408.3120 1432.4514 1461.5835 1471.9278 1481.2110 1572.8201 1592.9239 1610.4605 1656.8271 1663.9322 3020.2909 3080.0633 3115.3256 3148.0300 3159.6538 3163.0882 3178.2000 3183.5569 3520.8806
redmass: 4.3296 9.6687 7.4465 3.5678 1.2582 9.6420 5.1582 11.8181 8.1135 9.2507 6.5884 7.8028 7.4989 6.7168 3.4335 11.4155 7.9446 6.7917 7.5308 3.2005 9.9880 7.5542 6.6051 3.0483 9.9075 6.8707 4.9408 4.0355 4.0420 6.4882 3.9167 6.5732 3.2270 2.6573 5.6569 1.2461 1.5493 5.7930 3.3756 1.4726 2.4785 1.3560 3.7059 2.9418 3.0075 1.5472 1.3193 1.5854 3.8988 1.9485 3.3223 1.3335 1.2793 1.4812 4.0022 5.5839 4.0304 2.6647 5.0991 4.1978 1.2732 2.3017 1.0603 1.0708 7.4102 6.7103 9.9945 5.4369 11.4841 1.0330 1.0856 1.1026 1.1027 1.0883 1.0891 1.0973 1.0980 1.0770
irintensity: 0.1158 0.4883 0.0317 0.7421 0.1745 1.8559 3.2826 4.4603 6.4572 0.2751 0.9952 5.1813 2.2375 3.0513 7.4406 28.4353 37.7891 10.5724 3.9878 0.7975 4.7273 25.0287 51.9794 19.2197 4.3291 2.9092 10.8792 2.7137 18.9050 1.2279 7.9791 19.4484 21.0221 75.2506 32.5828 0.6611 69.5998 70.0148 4.3536 5.5738 28.0773 0.2494 39.3291 82.8446 16.9518 19.8789 0.4988 75.1340 47.1399 13.5706 74.0810 28.8221 3.1977 24.4175 306.7629 221.5682 61.7323 6.6901 52.5873 21.3109 144.8444 43.1441 23.1558 13.1696 34.0632 77.3646 443.0006 506.4655 77.9527 20.8478 3.4951 12.6221 0.4299 0.1802 0.3853 3.0148 3.1377 72.5158
temp: 298.150 k
press: 1.00000 atm
elementType: 17 8 8 8 7 7 7 7 6 6 6 6 6 6 6 6 6 6 6 1 1 1 1 1 1 1 1 1
symmnumber: 1
zpe: 508766.9 jmol-1
zpe.correction: 0.193779 hartree
zpe.thermalcorrener: 0.210974 hartree
zpe.thermalcorrenthalpy: 0.211918 hartree
zpe.thermalcorrgfe: 0.145403 hartree
zpe.sumelectzpe: -1327.943133 hartree
zpe.sumelectthermal: -1327.925938 hartree
zpe.sumelectthermalent: -1327.924994 hartree
zpe.sumelectthermalfe: -1327.991509 hartree
dipole: 0.5091 -1.2957 -0.1549
dipole: 1.4008
quadrupole: -113.7236 -119.9225 -121.5324
quadrupole: 3.7928 -0.0492 2.4831
quadrupole: 4.6692 -1.5297 -3.1395 3.7928 -0.0492 2.4831
hfenergy: -1328.136912 hartree
pointgroup: C01 [X(C11H9Cl1N4O3)]
dipole: 0.1629824 0.1845888 0.4930271 debye
polarizability: 299.5752238|10.0636672|120.3720116|4.4394686|-7.1833096|152.2203852 unknown
InChI: InChI=1S/C11H9ClN4O3/c1-16-10(18)8(9(17)13-11(16)19)15-14-7-4-2-6(12)3-5-7/h2-5,8,13H,1H3
charge 0 multiplicity 1
28 atoms
Cl 6.298546 0.040413 1.365132
O  -2.235473 2.39212 -0.865917
O  -1.826159 -2.145962 -2.197978
O  -4.226855 -1.029856 1.627058
N  -3.190191 0.712988 0.453105
N  -2.974781 -1.567808 -0.259331
N  -0.222471 -0.018907 -0.457519
N  0.815366 0.297027 -1.169103
C  -1.49421 0.10825 -1.282565
C  -2.347021 1.173912 -0.58243
C  -2.111026 -1.291307 -1.325782
C  -3.491124 -0.650925 0.682552
C  -3.867657 1.696105 1.334287
C  2.073893 0.206116 -0.481282
C  2.238768 -0.200697 0.873104
C  3.202713 0.559637 -1.263615
C  3.526381 -0.250469 1.434152
C  4.497327 0.512541 -0.708088
C  4.636985 0.107252 0.634473
H  -1.260548 0.444344 -2.306377
H  -3.308962 -2.531226 -0.152569
H  -4.960696 1.632873 1.209326
H  -3.513035 2.696329 1.047981
H  -3.620626 1.48107 2.385695
H  1.358332 -0.471741 1.463268
H  3.043753 0.867608 -2.301522
H  3.675602 -0.560667 2.472345
H  5.374567 0.782982 -1.3015
