program: Gaussian 09
title: 000245923
version: EM64L-G09RevD.01
frameworkgroup: C1[X(C17H12O4)]
method: RPBEPBE
basis: SDD
operation: Freq
keyword: #pfreq=noraman
keyword: PBEPBE/SDD
title: #p freq=noraman PBEPBE/SDD
converged: YES YES NO NO
title: Mulliken charges:
elementType: O O O O C C C C C C C C C C C C C C C C C H H H H H H H H H H H H
charge: -0.424579 -0.242461 -0.197613 -0.428697 -0.468482 0.472351 0.295851 0.539664 -0.070464 0.250170 -0.584199 -0.013256 -0.365816 -0.417005 -0.351413 -0.358885 -0.226736 -0.219825 -0.378451 -0.360068 0.284950 0.243652 0.263006 0.288910 0.224041 0.265346 0.288816 0.243801 0.243591 0.372614 0.222378 0.253189 0.355623
chargesum: 0.00000
title: Mulliken charges with hydrogens summed into heavy atoms:
elementType: O O O O C C C C C C C C C C C C C C C C C
charge: -0.051965 -0.242461 -0.197613 -0.073074 -0.224831 0.472351 0.295851 0.539664 -0.070464 0.250170 -0.321193 -0.013256 -0.076907 -0.192964 -0.086067 -0.070069 0.017065 0.023765 -0.156073 -0.106879 0.284950
polarizability: 2.96970608e+02 5.91477749e-01 2.09911581e+02 -6.78633443e+00 -7.58279068e+00 1.34133732e+02
1716.lowfreq: -7.2048 -4.8138 -0.0008 -0.0006 -0.0004 5.2760 17.2758 32.3498 38.1774
frequency: 16.6606 32.3074 38.1311 84.8679 122.4963 129.1370 167.8250 179.5102 182.1489 204.7561 256.2023 276.9906 299.0921 355.9685 365.2946 373.5857 391.2984 408.0075 408.5752 442.0766 452.5112 465.7399 488.5781 516.6178 544.7254 565.5860 566.2686 617.5075 634.9250 668.5533 680.5677 706.6700 722.6900 744.7469 764.7067 792.0061 798.3450 804.3055 823.8848 833.3092 841.7114 913.2996 926.2451 933.6260 937.7749 968.8161 978.6918 997.2428 1003.8654 1015.3779 1027.8541 1073.2729 1105.3128 1106.7062 1141.5257 1151.8835 1173.8886 1183.6711 1193.7225 1223.2955 1244.0183 1251.4778 1262.4466 1279.4927 1302.5672 1326.3873 1357.3536 1395.6798 1400.0410 1406.1278 1428.6536 1441.9983 1469.6888 1499.2894 1518.7539 1543.1147 1579.4144 1593.5769 1606.6583 1620.1228 1621.7744 3038.5611 3112.0192 3134.6902 3136.0707 3139.8669 3148.4459 3153.6073 3163.9892 3172.6447 3174.0599 3443.2055 3580.6388
redmass: 4.5682 7.2595 5.3650 7.7303 7.0379 5.3221 6.8965 5.9373 6.2980 4.8532 7.0140 7.1090 7.1632 5.8199 1.1311 10.2948 4.0724 3.0823 3.4317 5.5581 7.9362 6.1555 3.9695 5.1996 2.2850 1.2960 5.6807 5.2684 6.8206 3.5127 5.8153 4.2632 4.7434 4.4686 3.1554 1.8434 3.6072 1.4402 4.2565 3.2211 1.7171 1.4915 1.5654 1.8509 3.3275 1.4221 4.3046 1.3994 2.8572 1.3672 2.4516 3.2258 1.7737 1.8789 1.4866 2.0412 1.0810 1.1180 2.4652 1.4458 1.7057 2.5799 1.5093 1.7876 3.1895 1.3645 2.2219 3.6681 9.2342 1.3311 2.6326 2.5319 2.8148 2.6637 8.0484 8.9748 7.4907 6.2731 6.6739 6.8103 7.2234 1.0860 1.0871 1.0949 1.0940 1.0864 1.0886 1.0902 1.0948 1.0964 1.1004 1.0653 1.0660
irintensity: 1.7578 0.0894 2.6686 1.2630 3.5281 0.8587 2.2971 2.2114 3.8049 2.7590 2.7761 1.3835 0.6145 2.4564 134.1957 32.4890 15.3217 0.1711 3.1342 4.8770 2.7967 4.5950 7.8990 11.0577 8.2008 301.4935 6.2929 15.7766 1.2007 10.9703 3.4443 26.3522 11.5837 21.7332 12.8308 42.1404 29.2398 20.0816 5.5203 3.3106 39.0000 22.5971 2.7104 27.7061 14.0052 6.7654 57.7535 2.2687 2.9817 0.0372 8.2320 4.4703 20.8674 47.1850 281.9467 16.2684 7.4846 27.6387 11.3333 68.7313 71.6186 39.8429 31.6932 66.1549 254.9532 27.5665 62.9035 35.0495 1.3862 59.6295 11.1048 0.7464 1.4294 86.8215 62.0937 247.2712 37.2249 34.4734 1.1071 162.3462 15.5843 12.9472 15.4177 4.0437 21.2381 3.3650 0.9115 4.2018 1.8777 6.1753 25.0075 68.7569 62.4234
temp: 298.150 k
press: 1.00000 atm
elementType: 8 8 8 8 6 6 6 6 6 6 6 6 6 6 6 6 6 6 6 6 6 1 1 1 1 1 1 1 1 1 1 1 1
symmnumber: 1
zpe: 642223.6 jmol-1
zpe.correction: 0.244610 hartree
zpe.thermalcorrener: 0.261793 hartree
zpe.thermalcorrenthalpy: 0.262737 hartree
zpe.thermalcorrgfe: 0.198198 hartree
zpe.sumelectzpe: -954.439067 hartree
zpe.sumelectthermal: -954.421884 hartree
zpe.sumelectthermalent: -954.420940 hartree
zpe.sumelectthermalfe: -954.485479 hartree
dipole: 1.0130 -0.3996 -2.7638
dipole: 2.9706
quadrupole: -96.9967 -119.9069 -130.7191
quadrupole: -22.9859 4.6236 1.1612
quadrupole: 18.8775 -4.0327 -14.8449 -22.9859 4.6236 1.1612
hfenergy: -954.6836772 hartree
pointgroup: C01 [X(C17H12O4)]
dipole: -0.4113827 0.8087444 -0.7366048 debye
polarizability: 296.5054355|-8.0679499|175.5863269|-2.4911135|38.9235143|168.924158 unknown
InChI: InChI=1S/C17H12O4/c18-11-7-5-10(6-8-11)16(20)14-9-15(19)12-3-1-2-4-13(12)17(14)21/h1-9,16,18,20H
charge 0 multiplicity 1
33 atoms
O  1.223044 -1.768657 2.209634
O  -0.258887 0.565088 2.115082
O  -2.863548 -1.697145 -2.152347
O  5.38539 1.501085 -1.576283
C  1.113132 -1.611771 0.756067
C  -0.269559 -1.085073 0.348739
C  -2.187079 0.597971 0.667055
C  2.240385 -0.77592 0.133517
C  -0.866463 0.063847 1.10573
C  -2.875358 0.017012 -0.437499
C  -0.963537 -1.640157 -0.697253
C  -2.277938 -1.145325 -1.164717
C  -2.762279 1.693292 1.357211
C  2.994988 -1.313691 -0.936842
C  2.567792 0.523599 0.607099
C  -4.128134 0.535209 -0.838899
C  -4.011078 2.207102 0.950198
C  -4.694592 1.62802 -0.148375
C  4.046498 -0.583869 -1.5317
C  3.616501 1.26155 0.028497
C  4.354504 0.709008 -1.044756
H  1.202527 -2.64191 0.36853
H  -0.55616 -2.491094 -1.257036
H  -2.216379 2.12121 2.203738
H  2.769868 -2.320985 -1.308276
H  2.003883 0.961595 1.437035
H  -4.636163 0.068063 -1.688662
H  -4.453763 3.054198 1.484386
H  -5.664508 2.029174 -0.46071
H  0.982024 -0.891721 2.620535
H  4.623288 -1.021442 -2.356853
H  3.878669 2.259968 0.39058
H  5.846036 1.034765 -2.317523
