program: Gaussian 09
title: 000245912
version: EM64L-G09RevD.01
frameworkgroup: C1[X(C14H12ClNO2)]
method: RPBEPBE
basis: SDD
operation: Freq
keyword: #p
keyword: freq=noraman
keyword: PBEPBE/SDD
title: #p freq=noraman PBEPBE/SDD
converged: YES YES NO NO
title: Mulliken charges:
elementType: Cl O O N C C C C C C C C C C C C C C H H H H H H H H H H H H
charge: -0.062905 -0.400246 -0.376123 -0.387005 -0.504162 0.465401 0.158931 0.273058 -0.436491 -0.371379 0.130853 -0.259643 -0.217174 -0.222544 -0.327259 -0.158840 -0.237761 -0.201839 0.234114 0.274709 0.317506 0.234206 0.247133 0.220140 0.230260 0.230923 0.263185 0.259788 0.233171 0.389992
chargesum: 0.00000
title: Mulliken charges with hydrogens summed into heavy atoms:
elementType: Cl O O N C C C C C C C C C C C C C C
charge: -0.062905 -0.010255 -0.376123 -0.069499 0.004661 0.465401 0.158931 0.273058 -0.202285 -0.124246 0.130853 -0.039503 0.013086 0.008379 -0.064074 -0.158840 -0.004589 0.057948
polarizability: 2.37813683e+02 1.42083479e+01 1.75082024e+02 -1.89824112e+01 -1.39001908e+00 1.17928604e+02
1716.lowfreq: -8.3904 -5.2086 0.0012 0.0019 0.0020 4.6744 12.6867 23.8698 33.1952
frequency: 12.2560 23.8186 33.1553 55.1491 114.1205 128.3244 142.3690 190.0115 207.2940 238.1627 285.5842 322.8737 347.5287 371.7621 397.3477 403.8968 426.5838 436.6558 478.3144 513.1189 531.9989 560.2647 601.4016 617.0416 630.0658 672.2935 690.2996 706.1022 750.3172 753.5050 780.9206 820.2263 824.2120 849.4526 856.9488 865.5286 918.3924 949.9913 957.2673 976.2216 980.5126 990.5202 999.8263 1026.5718 1031.6553 1079.8102 1086.7251 1106.0625 1149.3301 1174.1139 1188.4369 1213.4054 1222.9720 1229.5867 1263.1256 1286.6919 1320.0349 1342.9431 1353.1599 1385.7904 1397.1338 1407.0749 1442.7343 1460.2585 1478.2548 1488.5769 1515.0287 1560.9574 1580.8126 1596.0325 1615.6044 1638.4998 2741.0384 2986.8637 3053.8374 3118.9297 3124.9750 3137.1920 3144.4614 3148.9931 3163.1305 3166.0555 3183.9107 3570.6333
redmass: 5.5336 4.0372 6.1354 5.8174 5.7223 7.1954 6.1820 4.0500 7.0286 5.5028 3.2415 6.9293 11.9840 4.5178 4.7323 2.8219 3.9109 4.7503 4.0247 3.1969 3.8675 1.8240 2.3076 6.2913 8.0990 5.3385 7.5014 1.8628 4.0256 1.8945 4.1057 4.6862 1.5463 1.5674 1.2688 4.2143 1.3788 1.0933 1.2893 2.5378 1.4087 6.1733 1.3426 2.2450 3.4629 2.0448 1.6097 2.3584 1.8710 1.0544 1.1118 1.8888 1.5101 1.4046 3.5585 1.6704 1.4056 1.9430 1.6529 6.5896 4.5061 3.3198 2.1321 2.4542 1.3561 1.6310 2.1127 7.4076 3.4947 6.0441 6.0379 4.2724 1.0703 1.0639 1.0975 1.0875 1.0867 1.0912 1.0915 1.0961 1.0889 1.1015 1.0976 1.0771
irintensity: 0.0954 0.1225 0.0167 5.3652 1.3063 0.5257 0.1329 1.4110 3.4703 0.9858 5.9668 1.4832 3.9491 23.5397 4.1868 0.7863 2.0184 1.1765 18.0317 7.0861 43.1767 51.6069 61.7200 1.0589 31.2057 0.0421 28.6018 52.0654 2.8478 51.0757 4.6059 0.6635 63.1314 14.9559 1.1085 11.6878 2.7867 118.5109 16.8741 19.1948 0.2799 1.0099 0.7667 11.6744 1.3299 12.3126 16.8750 3.9306 0.9061 0.0918 3.6360 1.6919 11.5345 128.4037 120.4319 140.4451 47.6108 111.7384 36.6555 10.0207 45.8330 47.9587 15.2241 211.1378 33.0015 3.3404 414.5808 163.1840 7.0927 4.2359 5.8751 47.1405 561.0764 35.7971 9.9016 7.9430 2.9292 10.4957 6.2149 36.4273 0.8542 21.1488 3.4838 23.9754
temp: 298.150 k
press: 1.00000 atm
elementType: 17 8 8 7 6 6 6 6 6 6 6 6 6 6 6 6 6 6 1 1 1 1 1 1 1 1 1 1 1 1
symmnumber: 1
zpe: 595698.7 jmol-1
zpe.correction: 0.226890 hartree
zpe.thermalcorrener: 0.242521 hartree
zpe.thermalcorrenthalpy: 0.243465 hartree
zpe.thermalcorrgfe: 0.180390 hartree
zpe.sumelectzpe: -1204.705538 hartree
zpe.sumelectthermal: -1204.689907 hartree
zpe.sumelectthermalent: -1204.688963 hartree
zpe.sumelectthermalfe: -1204.752038 hartree
dipole: 2.9846 2.3007 -0.8108
dipole: 3.8547
quadrupole: -100.2804 -126.4624 -107.1241
quadrupole: 3.7927 -3.6736 2.1543
quadrupole: 11.0085 -15.1734 4.1649 3.7927 -3.6736 2.1543
hfenergy: -1204.9324279 hartree
pointgroup: C01 [X(C14H12Cl1N1O2)]
dipole: 1.1304854 -0.8977383 -0.4647184 debye
polarizability: 233.2490941|-31.9791534|145.3160241|6.2965138|26.6000743|152.2591935 unknown
InChI: InChI=1S/C14H12ClNO2/c15-11-6-7-13(17)12(8-11)14(18)16-9-10-4-2-1-3-5-10/h1-8,16-17H,9H2
charge 0 multiplicity 1
30 atoms
Cl -3.740858 -1.894312 -2.541251
O  -2.715688 2.255864 1.690838
O  -0.368269 1.392679 1.947487
N  0.455513 -0.399418 0.737475
C  1.78087 -0.347152 1.387073
C  2.918757 -0.442094 0.377899
C  -1.86872 0.364862 0.355311
C  -0.556013 0.473268 1.049322
C  3.934927 -1.41612 0.533679
C  2.987789 0.455134 -0.719524
C  -2.906091 1.290406 0.732894
C  -2.145918 -0.602868 -0.651339
C  5.006289 -1.492665 -0.386149
C  4.054461 0.378427 -1.640901
C  -4.178701 1.218202 0.103723
C  -3.408405 -0.645289 -1.251562
C  5.068015 -0.595941 -1.476542
C  -4.435566 0.256548 -0.885093
H  1.865263 -1.163959 2.130564
H  1.805771 0.606546 1.944777
H  0.305507 -1.124619 0.036044
H  3.889944 -2.116316 1.377279
H  2.206582 1.214287 -0.846585
H  -1.390367 -1.324473 -0.978749
H  5.786808 -2.250077 -0.253747
H  4.099338 1.07799 -2.483008
H  -4.946855 1.932348 0.412217
H  -5.41535 0.202673 -1.368225
H  5.89613 -0.654363 -2.191474
H  -1.737266 2.152831 2.025865
