program: Gaussian 09
title: 000245852
version: EM64L-G09RevD.01
frameworkgroup: C1[X(C12H22N4O4)]
method: RPBEPBE
basis: SDD
operation: Freq
keyword: #p
keyword: freq=noraman
keyword: PBEPBE/SDD
title: #p freq=noraman PBEPBE/SDD
converged: YES YES NO NO
title: Mulliken charges:
elementType: O O O O N N N N C C C C C C C C C C C C H H H H H H H H H H H H H H H H H H H H H H
charge: -0.191024 -0.191040 -0.215048 -0.215047 -0.454933 -0.454938 -0.643429 -0.643428 -0.383832 -0.383827 -0.369982 -0.369985 -0.368281 -0.368288 -0.563316 -0.563289 0.272120 0.272124 0.277343 0.277351 0.195102 0.197731 0.197730 0.195098 0.188851 0.191373 0.188856 0.191377 0.205609 0.241150 0.241164 0.205594 0.211809 0.247422 0.247411 0.211795 0.303774 0.303775 0.347052 0.310512 0.347051 0.310513
chargesum: 0.00000
title: Mulliken charges with hydrogens summed into heavy atoms:
elementType: O O O O N N N N C C C C C C C C C C C C
charge: -0.191024 -0.191040 -0.215048 -0.215047 -0.151159 -0.151162 0.014135 0.014135 0.009001 0.009001 0.010243 0.010248 0.078478 0.078470 -0.104085 -0.104083 0.272120 0.272124 0.277343 0.277351
polarizability: 2.49053815e+02 -1.01995658e+01 1.64342271e+02 -4.51070380e+00 2.51299248e+00 1.13547533e+02
1716.lowfreq: -4.9980 -0.0014 -0.0006 0.0009 1.3752 5.6319 7.5145 9.0921 20.1063
frequency: 7.5130 9.0917 20.1063 21.5066 41.8149 43.2075 47.4038 57.4365 67.2752 91.7548 102.2141 105.7597 117.5090 132.2270 141.8167 144.8220 153.7074 170.1899 216.0685 259.3149 277.5088 347.5181 369.9691 387.0544 395.6022 425.3345 428.1691 453.0620 470.2768 529.1144 532.9680 554.9126 555.6261 583.2555 588.5236 597.9248 598.2056 710.8247 710.8641 724.2176 727.6239 730.4645 739.1889 750.0626 792.3348 843.3019 884.7016 895.4017 927.5135 938.5417 940.4444 998.5807 1003.5140 1010.1806 1052.7000 1054.0005 1055.5394 1067.3696 1080.2882 1083.9970 1093.2173 1096.5058 1101.5296 1154.9840 1155.2920 1201.6009 1208.4833 1238.7802 1243.9960 1271.5324 1273.3892 1284.1901 1288.8237 1290.6125 1297.3536 1298.0160 1301.1624 1320.6594 1343.4471 1357.1466 1358.2280 1361.5150 1426.5146 1428.2026 1438.9112 1439.1560 1461.3303 1462.4258 1466.1714 1473.3910 1482.0783 1487.7361 1605.8653 1605.9229 1650.6965 1650.7201 1699.7165 1699.8396 2948.1094 2950.0818 2953.9410 2959.4487 2959.6499 2963.5945 2984.5727 2986.6875 2989.5220 2994.0086 3008.6529 3010.2509 3011.6323 3034.5067 3061.2200 3062.6023 3519.8496 3519.8616 3529.5371 3529.5493 3682.9258 3682.9360
redmass: 5.5017 5.6611 6.5296 4.6813 6.3322 2.4231 6.0620 2.6262 3.5599 2.2621 2.7743 4.1238 7.6040 2.1207 3.7549 2.9248 2.1806 4.9548 6.0964 4.9116 5.6731 4.4097 2.9448 1.9594 2.4675 1.6946 1.6576 3.1493 3.3960 2.9766 2.9140 1.2765 1.2346 2.7873 2.7032 1.1876 1.2181 4.7483 4.5274 1.1223 1.3451 3.5223 3.2688 1.3864 1.3981 1.5311 3.1414 3.3921 1.6154 5.3402 6.3607 1.3671 4.6297 3.5253 3.7491 1.9586 1.9423 2.6014 2.1004 2.1725 1.6659 3.8778 1.4005 1.9788 2.2665 1.5853 1.2982 1.3657 1.3430 1.3578 1.2524 1.0422 2.5416 1.9963 1.1650 1.1607 1.3308 1.4881 1.5357 1.5879 1.7111 1.6508 2.0182 1.9884 1.1125 1.1271 1.0729 1.0733 1.0726 1.0914 1.0967 1.0997 1.2064 1.2067 5.0172 5.0076 7.3873 7.3801 1.0588 1.0593 1.0592 1.0591 1.0591 1.0590 1.0890 1.0757 1.0730 1.0872 1.0962 1.0971 1.1027 1.1047 1.1025 1.1025 1.0724 1.0724 1.0496 1.0496 1.1040 1.1040
irintensity: 25.2080 6.2532 14.1035 0.0002 6.0754 0.0003 0.0000 1.9855 0.0000 2.4322 0.0000 2.4577 0.0000 0.0000 5.2041 0.0000 1.3762 0.0000 3.6295 4.2841 0.0000 5.9466 0.0001 54.4864 0.0002 0.0086 136.7424 0.0000 14.4148 43.9070 0.0001 0.1628 476.8216 0.0002 4.1956 0.0048 158.3818 64.5814 0.0378 29.6204 0.0000 2.9995 0.0000 17.5142 0.0000 14.2459 0.0000 17.0575 0.0000 0.0005 31.0713 7.4354 0.0000 14.6143 3.2389 0.0001 33.2182 0.0000 0.0000 13.8955 0.0001 0.0000 55.3475 321.6121 0.9234 0.0000 129.8496 10.7650 0.0000 126.9974 0.0002 0.0000 0.0005 176.6612 9.3264 0.0000 5.6066 0.0000 10.7030 0.0000 0.0000 3.0317 1410.9341 0.0002 118.1526 0.0010 0.3162 0.0000 0.0000 4.1298 0.0000 31.1413 124.2506 0.0661 55.9870 4.3247 0.2200 794.3812 11.4925 0.0000 0.0000 33.7149 0.0235 109.7676 0.0003 50.4480 0.0002 33.7640 0.0002 28.5514 0.0006 64.8250 0.0019 142.3160 7.3992 7.9510 79.4748 4.5493 42.1085 22.7327
temp: 298.150 k
press: 1.00000 atm
elementType: 8 8 8 8 7 7 7 7 6 6 6 6 6 6 6 6 6 6 6 6 1 1 1 1 1 1 1 1 1 1 1 1 1 1 1 1 1 1 1 1 1 1
symmnumber: 1
zpe: 909937.7 jmol-1
zpe.correction: 0.346577 hartree
zpe.thermalcorrener: 0.370451 hartree
zpe.thermalcorrenthalpy: 0.371395 hartree
zpe.thermalcorrgfe: 0.285521 hartree
zpe.sumelectzpe: -988.861091 hartree
zpe.sumelectthermal: -988.837217 hartree
zpe.sumelectthermalent: -988.836273 hartree
zpe.sumelectthermalfe: -988.922147 hartree
dipole: -0.0003 0.0006 -0.0048
dipole: 0.0049
quadrupole: -124.1931 -123.6782 -119.0188
quadrupole: -106.4870 -15.7167 4.4091
quadrupole: -1.8964 -1.3815 3.2779 -106.4870 -15.7167 4.4091
hfenergy: -989.2076681 hartree
pointgroup: C01 [X(C12H22N4O4)]
dipole: 0.0000796 -0.0008882 -0.0016941 debye
polarizability: 249.1254399|-9.6849231|156.3104127|4.2886559|-18.7838323|121.5077665 unknown
InChI: InChI=1S/C12H22N4O4/c13-11(19)15-9(17)7-5-3-1-2-4-6-8-10(18)16-12(14)20/h15-16H,1-8,13-14H2
charge 0 multiplicity 1
42 atoms
O  5.846631 1.444688 -0.507774
O  -5.843353 -1.439731 0.518804
O  8.710694 0.740796 -0.863141
O  -8.707625 -0.735823 0.873041
N  6.91188 -0.60692 -0.066036
N  -6.908703 0.611471 0.075461
N  9.127111 -1.070902 0.545359
N  -9.123791 1.074773 -0.536958
C  0.671332 0.367031 0.129051
C  -0.668201 -0.36192 -0.119076
C  1.905743 -0.477554 -0.259186
C  -1.902617 0.482642 0.269193
C  3.238926 0.26296 -0.017876
C  -3.235788 -0.257905 0.027915
C  4.467589 -0.590684 -0.393892
C  -4.46448 0.595677 0.404012
C  5.781594 0.205548 -0.332148
C  -5.778411 -0.200682 0.342477
C  8.288955 -0.217119 -0.174983
C  -8.285768 0.221572 0.184234
H  0.742664 0.649456 1.200189
H  0.685087 1.317287 -0.444142
H  -0.681942 -1.312184 0.454103
H  -0.739541 -0.644329 -1.190219
H  1.892717 -1.427477 0.316132
H  1.831415 -0.761216 -1.330265
H  -1.889629 1.432571 -0.306115
H  -1.828274 0.766294 1.340272
H  3.312871 0.565397 1.045621
H  3.269732 1.19833 -0.606743
H  -3.266546 -1.193283 0.616774
H  -3.309757 -0.56032 -1.035589
H  4.522741 -1.49392 0.247641
H  4.355249 -0.954716 -1.436897
H  -4.352055 0.959721 1.447002
H  -4.519756 1.498899 -0.237527
H  6.724278 -1.588704 0.152765
H  -6.721166 1.593139 -0.143911
H  10.128074 -0.902244 0.465158
H  8.792229 -1.690063 1.281538
H  -10.124766 0.906112 -0.456899
H  -8.788746 1.693334 -1.273568
